{"text_format":"1","workbook":"xlsx","n_sheets":15,"sheets":["Indhold","Vandret procentuering","Lodret procentuering","Vandret procentuering (2)","Lodret procentuering (2)","Vandret Indekstal","Lodret Indekstal","Vandret Vækstrate","Lodret Vækstrate","Stikprøveusikkerhed Andel","Måling vs valg","chi_help","Regressionsanalyse","Regressionssimulator","R-square_help"],"not_rendered":{"charts":5,"images":2,"macros":1,"external_links":2,"defined_names":59,"comments":0,"pivot_tables":0},"unopened":[],"bounds":{"document_bytes":16777216,"sheet_cells":100000,"rows_first":2000,"rows_last":500,"rows_between":2000,"halvings":0,"cell_chars":16384,"cell_head_chars":4096},"cells_cut":0,"cells_raw":0,"read":"whole","date_system":"1900"}

{"sheet":"Indhold","index":0,"n_rows":17,"n_cols":3,"rows_kept":17,"cut":false,"hidden":false,"merged":[]}
[]
[]
[null,"Den samfundsfaglige Regnemaskine"]
[]
[null,"Indhold","Relevans"]
[null,"1. Vandret procentuering af krydstabel","Ny ordning"]
[null,"2. Lodret procentuering af krydstabel","Ny ordning"]
[null,"3. Vandret procentuering af tidsserie","Ny ordning"]
[null,"4. Lodret procentuering af tidsserie","Ny ordning"]
[null,"5. Vandret Indekstal på tidsserie","Ny ordning"]
[null,"6. Lodret Indekstal på tidsserie","Ny ordning"]
[null,"7. Vandret vækstrate","Ny ordning"]
[null,"8. Lodret vækstrate","Ny ordning"]
[null,"9. Stikprøveusikkerhed (andele)","Ny ordning"]
[null,"10. Stikprøveusikkerhed (Måling vs. Valg)","Ny ordning"]
[null,"11. Regressionsanalyse","Ny ordning"]
[null,"12. Regressionssimulator","Ny ordning"]

{"sheet":"Vandret procentuering","index":1,"n_rows":53,"n_cols":21,"rows_kept":53,"cut":false,"hidden":false,"merged":[[0,20,0,23],[41,20,41,23],[4,2,4,17],[31,2,31,17],[33,0,52,0],[6,0,25,0]]}
["Vandret procentuering af krydstabel (Bruges når den uafhængige variabel er placeret i forspalten se illustration).",null,null,null,null,null,null,null,null,null,null,null,null,null,null,null,null,null,null,null,"Tilbage til hovedmenuen"]
[]
["Tabel 1: Absolutte tal"]
[]
[null,null,"Afhængig variabel"]
[null,null,"Kolonne 1","Kolonne 2","Kolonne 3","Kolonne 4","Kolonne 5","Kolonne 6","Kolonne 7","Kolonne 8","Kolonne 9","Kolonne 10","Kolonne 11","Kolonne 12","Kolonne 13","Kolonne 14","Kolonne 15","Kolonne 16","I alt"]
["Uafhængig variabel","Række 1",null,null,null,null,null,null,null,null,null,null,null,null,null,null,null,null,{"$f":"SUM(C7:R7)","v":0}]
[null,"Række 2",null,null,null,null,null,null,null,null,null,null,null,null,null,null,null,null,{"$f":"SUM(C8:R8)","v":0}]
[null,"Række 3",null,null,null,null,null,null,null,null,null,null,null,null,null,null,null,null,0]
[null,"Række 4",null,null,null,null,null,null,null,null,null,null,null,null,null,null,null,null,0]
[null,"Række 5",null,null,null,null,null,null,null,null,null,null,null,null,null,null,null,null,0]
[null,"Række 6",null,null,null,null,null,null,null,null,null,null,null,null,null,null,null,null,0]
[null,"Række 7",null,null,null,null,null,null,null,null,null,null,null,null,null,null,null,null,0]
[null,"Række 8",null,null,null,null,null,null,null,null,null,null,null,null,null,null,null,null,0]
[null,"Række 9",null,null,null,null,null,null,null,null,null,null,null,null,null,null,null,null,0]
[null,"Række 10",null,null,null,null,null,null,null,null,null,null,null,null,null,null,null,null,0]
[null,"Række 11",null,null,null,null,null,null,null,null,null,null,null,null,null,null,null,null,0]
[null,"Række 12",null,null,null,null,null,null,null,null,null,null,null,null,null,null,null,null,0]
[null,"Række 13",null,null,null,null,null,null,null,null,null,null,null,null,null,null,null,null,0]
[null,"Række 14",null,null,null,null,null,null,null,null,null,null,null,null,null,null,null,null,0]
{"$rows_left_out":34}
{"sheet":"Lodret procentuering","index":2,"n_rows":55,"n_cols":18,"rows_kept":55,"cut":false,"hidden":false,"merged":[[1,10,1,17],[5,2,5,11],[32,2,32,11],[7,0,26,0],[34,0,53,0]]}
["Lodret procentuering af krydstabel (Bruges når den uafhængige variabel er placeret i hovedspalten se illustration)."]
[null,null,null,null,null,null,null,null,null,null,"Tilbage til hovedmenuen"]
[]
["Tabel 1: Absolutte tal"]
[]
[null,null,"Uafhængig variabel"]
[null,null,"Kolonne 1","Kolonne 2","Kolonne 3","Kolonne 4","Kolonne 5","Kolonne 6","Kolonne 7","Kolonne 8","Kolonne 9","Kolonne 10","Kolonne 11","Kolonne 12","Kolonne 13","Kolonne 14","Kolonne 15","Kolonne 16"]
["Afhængig variabel","Række 1"]
[null,"Række 2"]
[null,"Række 3"]
[null,"Række 4"]
[null,"Række 5"]
[null,"Række 6"]
[null,"Række 7"]
[null,"Række 8"]
[null,"Række 9"]
[null,"Række 10"]
[null,"Række 11"]
[null,"Række 12"]
[null,"Række 13"]
{"$rows_left_out":36}
{"sheet":"Vandret procentuering (2)","index":3,"n_rows":56,"n_cols":19,"rows_kept":56,"cut":false,"hidden":false,"merged":[[6,2,6,17],[8,0,28,0],[33,2,33,17],[35,0,55,0],[2,10,2,17]]}
["Vandret procentuering af tidsserie"]
[]
["Begyndelsesår",1,null,null,null,null,null,null,null,null,"Tilbage til hovedmenuen"]
[]
["Tabel 1: Absolutte tal"]
[]
[null,null,"Afhængig variabel"]
[null,null,"Kolonne 1","Kolonne 2","Kolonne 3","Kolonne 4","Kolonne 5","Kolonne 6","Kolonne 7","Kolonne 8","Kolonne 9","Kolonne 10","Kolonne 11","Kolonne 12","Kolonne 13","Kolonne 14","Kolonne 15","Kolonne 16","I alt"]
["Tid - Årstal",{"$f":"+$B$3","v":1},null,null,null,null,null,null,null,null,null,null,null,null,null,null,null,null,{"$f":"SUM(C9:R9)","v":0}]
[null,{"$f":"+B9+1","v":2},null,null,null,null,null,null,null,null,null,null,null,null,null,null,null,null,{"$f":"SUM(C10:R10)","v":0}]
[null,{"$f":"+B10+1","v":3},null,null,null,null,null,null,null,null,null,null,null,null,null,null,null,null,0]
[null,4,null,null,null,null,null,null,null,null,null,null,null,null,null,null,null,null,0]
[null,5,null,null,null,null,null,null,null,null,null,null,null,null,null,null,null,null,0]
[null,6,null,null,null,null,null,null,null,null,null,null,null,null,null,null,null,null,0]
[null,7,null,null,null,null,null,null,null,null,null,null,null,null,null,null,null,null,0]
[null,8,null,null,null,null,null,null,null,null,null,null,null,null,null,null,null,null,0]
[null,9,null,null,null,null,null,null,null,null,null,null,null,null,null,null,null,null,0]
[null,10,null,null,null,null,null,null,null,null,null,null,null,null,null,null,null,null,0]
[null,11,null,null,null,null,null,null,null,null,null,null,null,null,null,null,null,null,0]
[null,12,null,null,null,null,null,null,null,null,null,null,null,null,null,null,null,null,0]
{"$rows_left_out":37}
{"sheet":"Lodret procentuering (2)","index":4,"n_rows":56,"n_cols":19,"rows_kept":56,"cut":false,"hidden":false,"merged":[[8,0,27,0],[35,0,54,0],[1,9,1,14],[6,2,6,18],[33,2,33,18]]}
["Lodret procentuering af tidsserie"]
[null,null,null,null,null,null,null,null,null,"Tilbage til hovedmenuen"]
["Begyndelsesår"]
[]
["Tabel 1: Absolutte tal"]
[]
[null,null,"Tid - Årstal"]
[null,null,{"$f":"+$B$3","v":0},{"$f":"+C8+1","v":1},{"$f":"+D8+1","v":2},3,4,5,6,7,8,9,10,11,12,{"$f":"+O8+1","v":13},{"$f":"+P8+1","v":14},{"$f":"+Q8+1","v":15},{"$f":"+R8+1","v":16}]
["Afhængig variabel","Række 1"]
[null,"Række 2"]
[null,"Række 3"]
[null,"Række 4"]
[null,"Række 5"]
[null,"Række 6"]
[null,"Række 7"]
[null,"Række 8"]
[null,"Række 9"]
[null,"Række 10"]
[null,"Række 11"]
[null,"Række 12"]
{"$rows_left_out":37}
{"sheet":"Vandret Indekstal","index":5,"n_rows":54,"n_cols":19,"rows_kept":54,"cut":false,"hidden":false,"merged":[[1,9,1,14],[7,0,26,0],[34,0,53,0],[5,2,5,18],[32,2,32,18]]}
["Vandret indekstal på tidsserie"]
[null,null,null,null,null,null,null,null,null,"Tilbage til hovedmenuen"]
["Tabel 1: Absolutte tal"]
[]
["Begyndelsesår"]
[null,null,"Tid - År"]
[null,null,{"$f":"+$B$5","v":0},{"$f":"+C7+1","v":1},{"$f":"+D7+1","v":2},3,4,5,6,7,8,9,{"$f":"+L7+1","v":10},{"$f":"+M7+1","v":11},{"$f":"+N7+1","v":12},{"$f":"+O7+1","v":13},{"$f":"+P7+1","v":14},{"$f":"+Q7+1","v":15},{"$f":"+R7+1","v":16}]
["Afhængig variabel","Række 1",894,914,908,890,882,883,877]
[null,"Række 2",2635,2521,2503,2499,2487,2497,2524]
[null,"Række 3",4573,4592,5608,11159,14707,11141,9582]
[null,"Række 4",11449,12946,11837,13297,15389,17725,20102]
[null,"Række 5",20132,25157,39635,72192,136806,200023,266449]
[null,"Række 6",46552,38471,17257,30549,48218,68378,64144]
[null,"Række 7",22558,23244,28562,32892,52568,84772,62525]
[null,"Række 8",55904,49089,43891,53568,59766,50996,49916]
[null,"Række 9",6750,9534,13217,10782,11385,11955,20796]
[null,"Række 10",61531,47851,45495,42223,44074,41032,51190]
[null,"Række 11",651972,521923,449369,655407,826247,687112,718689]
[null,"Række 12",1515685,1135277,1076758,1383821,1753261,1742601,1914432]
[null,"Række 13"]
{"$rows_left_out":35}
{"sheet":"Lodret Indekstal","index":6,"n_rows":57,"n_cols":18,"rows_kept":57,"cut":false,"hidden":false,"merged":[[8,0,28,0],[36,0,56,0],[2,11,2,18],[6,2,6,17],[34,2,34,17]]}
["Lodret indekstal på tidsserie"]
[]
["Tabel 1: Absolutte tal",null,null,null,null,null,null,null,null,null,null,"Tilbage til hovedmenuen"]
[]
["Begyndelsesår"]
[]
[null,null,"Afhængig variabel"]
[null,null,"Kolonne 1","Kolonne 2","Kolonne 3","Kolonne 4","Kolonne 5","Kolonne 6","Kolonne 7","Kolonne 8","Kolonne 9","Kolonne 10","Kolonne 11","Kolonne 12","Kolonne 13","Kolonne 14","Kolonne 15","Kolonne 16"]
["Tid - År",{"$f":"+$B$5","v":0}]
[null,{"$f":"+B9+1","v":1}]
[null,{"$f":"+B10+1","v":2}]
[null,3]
[null,4]
[null,5]
[null,6]
[null,7]
[null,8]
[null,9]
[null,10]
[null,11]
{"$rows_left_out":38}
{"sheet":"Vandret Vækstrate","index":7,"n_rows":56,"n_cols":19,"rows_kept":56,"cut":false,"hidden":false,"merged":[[7,2,7,18],[9,0,28,0],[34,2,34,18],[36,0,55,0],[2,10,2,15]]}
["Vandret Vækstrate"]
[]
[null,null,null,null,null,null,null,null,null,null,"Tilbage til hovedmenuen"]
["Tabel 1: Absolutte tal"]
[]
["Begyndelsesår"]
[]
[null,null,"Tid - År"]
[null,null,{"$f":"+$B$6","v":0},{"$f":"+C9+1","v":1},{"$f":"+D9+1","v":2},3,4,5,6,7,8,9,{"$f":"+L9+1","v":10},{"$f":"+M9+1","v":11},{"$f":"+N9+1","v":12},{"$f":"+O9+1","v":13},{"$f":"+P9+1","v":14},{"$f":"+Q9+1","v":15},{"$f":"+R9+1","v":16}]
["Afhængig variabel","Række 1"]
[null,"Række 2"]
[null,"Række 3"]
[null,"Række 4"]
[null,"Række 5"]
[null,"Række 6"]
[null,"Række 7"]
[null,"Række 8"]
[null,"Række 9"]
[null,"Række 10"]
[null,"Række 11"]
{"$rows_left_out":37}
{"sheet":"Lodret Vækstrate","index":8,"n_rows":57,"n_cols":18,"rows_kept":57,"cut":false,"hidden":false,"merged":[[9,0,29,0],[37,0,56,0],[2,11,2,18],[35,2,35,17],[7,2,7,17]]}
["Lodret Vækstrate"]
[]
[null,null,null,null,null,null,null,null,null,null,null,"Tilbage til hovedmenuen"]
["Tabel 1: Absolutte tal"]
[]
["Begyndelsesår"]
[]
[null,null,"Afhængig variabel"]
[null,null,"Kolonne 1","Kolonne 2","Kolonne 3","Kolonne 4","Kolonne 5","Kolonne 6","Kolonne 7","Kolonne 8","Kolonne 9","Kolonne 10","Kolonne 11","Kolonne 12","Kolonne 13","Kolonne 14","Kolonne 15","Kolonne 16"]
["Tid - År",{"$f":"+$B$6","v":0}]
[null,{"$f":"+B10+1","v":1}]
[null,{"$f":"+B11+1","v":2}]
[null,3]
[null,4]
[null,5]
[null,6]
[null,7]
[null,8]
[null,9]
[null,10]
{"$rows_left_out":38}
{"sheet":"Stikprøveusikkerhed Andel","index":9,"n_rows":20,"n_cols":12,"rows_kept":20,"cut":false,"hidden":false,"merged":[[14,0,14,3],[0,11,0,14],[21,10,26,19]]}
["Konfidensinterval for populationsandel",null,null,null,null,null,null,null,null,null,null,"Tilbage til hovedmenuen"]
[]
[]
[null,null,null,null,null,null,null,null,{"$f":"+B6*(B7/100)","v":206.36}]
["Sikkerhedsniveau",0.95,"1-a","Forudsætning:",null,null,null,null,{"$f":"+B6*(1-(B7/100))","v":1333.64}]
["Stikprøvestørrelse",1540,"n","Både np og  n(1-p) er >= 5"]
["Stikprøveandel",13.4,"p-hat",{"$f":"IF(MIN(I4:I5)<5,\"Stikprøven er for lille :-(\",\"Stikprøven er stor nok :-)\")","v":"Stikprøven er stor nok :-)"}]
[]
[]
["Konfidensinterval",{"$f":"B7","v":13.4},"±",{"$f":"-NORMSINV((1-$B$5)/2)*SQRT(B7*(100-B7)/B6)","v":1.7013711952663375}," = ","[",{"$f":"B10-D10","v":11.698628804733662},",",{"$f":"B10+D10","v":15.101371195266339},"]"]
[]
["Sammenligningsværdi",21.1]
[]
[]
["Tilbage til hovedmenuen"]
[]
["Konfidensinterval"]
["KI Lav",{"$f":"+G10","v":11.698628804733662},1.5]
["KI Høj",{"$f":"+I10","v":15.101371195266339},1.5]
["Sammenligningsværdi",{"$f":"+B12","v":21.1},1.5]
{"$rows_left_out":1}
{"sheet":"Måling vs valg","index":10,"n_rows":48,"n_cols":19,"rows_kept":48,"cut":false,"hidden":false,"merged":[[0,0,0,10],[2,5,2,6],[1,16,1,19]]}
["Stikprøveusikkerhed og meningsmålinger"]
[null,null,null,null,null,null,null,null,null,null,null,null,null,null,null,null,"Tilbage til hovedmenuen"]
[null,"FV 2019","Måling","Difference","Usikkerheds-","Konfidensinterval",null,null,"Test","P-værdi","Signifikant","Signifikant","Signifikant","Signifikant","Signifikant"]
["Parti","Procent","Procent","Procentpoint","margin","Nedre","Øvre","Konfidensinterval","størrelse",null,"ændring?","fremgang","tilbagegang","over spærregrænsen?","under spærregrænsen?"]
["Socialdemokratiet",27.5,20.8,{"$f":"+C5-B5","v":-6.6999999999999993},{"$f":"NORMINV($B$29+(1-$B$29)/2,0,1)*(C5*(100-C5)/$B$26)^0.5","v":1.8781536990059042},{"$f":"ROUND(+C5-E5,1)","v":18.899999999999999},{"$f":"ROUND(+C5+E5,1)","v":22.7},{"$f":"\"[ \"&F5&\"; \"&G5&\" ]\"","v":"[ 18,9; 22,7 ]"},{"$f":"IF(C5/100=0,\"\",(C5/100-B5/100)/((C5/100*(1-C5/100)/$B$26))^0.5)","v":-6.9918445457200455},{"$f":"(IF(I5>0,1-_xlfn.NORM.DIST(I5,0,1,TRUE),_xlfn.NORM.DIST(I5,0,1,TRUE)))*2","v":2.7129539958870516E-12},{"$f":"IF(AND(B5>F5,B5<G5),\"Nej\",\"Ja\")","v":"Ja"},{"$f":"IF(AND(D5>0,K5=\"Ja\"),\"Ja\",\"Nej\")","v":"Nej"},{"$f":"IF(AND(D5<0,K5=\"Ja\"),\"Ja\",\"Nej\")","v":"Ja"},{"$f":"IF(F5>=2,\"Ja\",\"Nej\")","v":"Ja"},{"$f":"IF(G5<2,\"Ja\",\"Nej\")","v":"Nej"},null,null,{"$f":"+F5","v":18.899999999999999},{"$f":"+G5-F5","v":3.8000000000000007}]
["Venstre",13.3,9.1,-4.2000000000000011,{"$f":"NORMINV($B$29+(1-$B$29)/2,0,1)*(C6*(100-C6)/$B$26)^0.5","v":1.3308818716315294},{"$f":"ROUND(+C6-E6,1)","v":7.8},{"$f":"ROUND(+C6+E6,1)","v":10.4},{"$f":"\"[ \"&F6&\"; \"&G6&\" ]\"","v":"[ 7,8; 10,4 ]"},{"$f":"IF(C6/100=0,\"\",(C6/100-B6/100)/((C6/100*(1-C6/100)/$B$26))^0.5)","v":-6.185258744998003},{"$f":"(IF(I6>0,1-_xlfn.NORM.DIST(I6,0,1,TRUE),_xlfn.NORM.DIST(I6,0,1,TRUE)))*2","v":6.2000689262687366E-10},"Ja",{"$f":"IF(AND(D6>0,K6=\"Ja\"),\"Ja\",\"Nej\")","v":"Nej"},{"$f":"IF(AND(D6<0,K6=\"Ja\"),\"Ja\",\"Nej\")","v":"Ja"},{"$f":"IF(F6>=2,\"Ja\",\"Nej\")","v":"Ja"},{"$f":"IF(G6<2,\"Ja\",\"Nej\")","v":"Nej"},null,null,{"$f":"+F6","v":7.8},{"$f":"+G6-F6","v":2.6000000000000005}]
["Moderate",9.3000000000000007,9,-0.30000000000000071,1.3242769580496483,7.7,10.3,"[ 7,7; 10,3 ]",-0.44400772194057536,0.65703700103254659,"Nej",{"$f":"IF(AND(D7>0,K7=\"Ja\"),\"Ja\",\"Nej\")","v":"Nej"},"Nej","Ja","Nej",null,null,7.7,2.6000000000000005]
["SF",8.3000000000000007,13.1,4.7999999999999989,1.5612857925522901,11.5,14.7,"[ 11,5; 14,7 ]",6.0256918820819765,1.6838770378058143E-9,"Ja","Ja","Nej","Ja","Nej",null,null,11.5,3.1999999999999993]
["Danmarksdemokraterne",8.1,8.9,0.80000000000000071,1.3176226855124875,7.6,10.199999999999999,"[ 7,6; 10,2 ]",1.1900001456199762,0.23404633481160175,"Nej","Nej","Nej","Ja","Nej",null,null,7.6,2.5999999999999996]
["LA",7.9,11,3.0999999999999996,1.4478654925954195,9.6,12.4,"[ 9,6; 12,4 ]",4.1964453073487027,2.7113689884394887E-5,"Ja","Ja","Nej","Ja","Nej",null,null,9.6,2.8000000000000007]
["Konservative",5.5,5.5,0,1.0549554514245596,4.4000000000000004,6.6,"[ 4,4; 6,6 ]",0,1,"Nej","Nej","Nej","Ja","Nej",null,null,4.4000000000000004,2.1999999999999993]
["El",5.0999999999999996,7.6,2.5,1.2262517873858632,6.4,8.8000000000000007,"[ 6,4; 8,8 ]",3.9958432776647084,6.4464371533068388E-5,"Ja","Ja","Nej","Ja","Nej",null,null,6.4,2.4000000000000004]
["Radikale",3.8,3.3,-0.5,{"$f":"NORMINV($B$29+(1-$B$29)/2,0,1)*(C13*(100-C13)/$B$26)^0.5","v":0.82662222666348839},2.5,{"$f":"ROUND(+C13+E13,1)","v":4.0999999999999996},"[ 2,5; 4,1 ]",-1.1855258190014402,0.23580961250529436,"Nej","Nej","Nej","Ja","Nej",null,null,{"$f":"+F13","v":2.5},{"$f":"+G13-F13","v":1.5999999999999996}]
["Nye borgerlige",3.7,2.7,-1,0.75002402294657455,1.9,3.5,"[ 1,9; 3,5 ]",-2.6132016103165072,8.96983715826522E-3,"Ja","Nej","Ja","Nej","Nej",null,null,{"$f":"+F14","v":1.9},{"$f":"+G14-F14","v":1.6}]
["Alternativet",3.3,2.2000000000000002,-1.0999999999999996,0.67876218568510749,1.5,2.9,"[ 1,5; 2,9 ]",-3.1763118636580256,1.4916050454062957E-3,"Ja","Nej","Ja","Nej","Nej",null,null,1.5,1.4]
["DF",2.6,4.7,2.1,0.97933719890092896,3.7,5.7,"[ 3,7; 5,7 ]",4.2027652703821019,2.6367397126136893E-5,"Ja","Ja","Nej","Ja","Nej",null,null,3.7,2]
["Frie Grønne",0.9,0.6,-0.30000000000000004,0.35735979395203854,0.2,1,"[ 0,2; 1 ]",-1.6453703111350311,9.989346817196143E-2,"Nej","Nej","Nej","Nej","Ja",null,null,0.2,0.8]
[null,null,null,0,0,0,0,"[ 0; 0 ]","",{"$error":"#VALUE!"},"Ja","Nej","Nej","Nej","Ja",null,null,0,0]
[null,null,null,0,0,0,0,"[ 0; 0 ]","",{"$error":"#VALUE!"},"Ja","Nej","Nej","Nej","Ja",null,null,0,0]
[null,null,null,0,0,0,0,"[ 0; 0 ]","",{"$error":"#VALUE!"},"Ja","Nej","Nej","Nej","Ja",null,null,0,0]
{"$rows_left_out":29}
{"sheet":"chi_help","index":11,"n_rows":1009,"n_cols":4,"rows_kept":1009,"cut":false,"hidden":true,"merged":[]}
[]
[]
["Start",0,"Kritisk værdi",{"$f":"ROUND(#REF!,3)","v":{"$error":"#REF!"}}]
["Interval",{"$f":"MAX(#REF!,#REF!)/800","v":{"$error":"#REF!"}},"Teststørrelse",{"$f":"ROUND(#REF!,3)","v":{"$error":"#REF!"}}]
[]
[]
[]
[null,"Chi2","Kritisk værdi","Teststørrelse"]
[{"$f":"+$B$3","v":0},{"$f":"_xlfn.CHISQ.DIST(A9,#REF!,FALSE)","v":{"$error":"#REF!"}},{"$f":"IF($A9<$D$3,IF($A10>$D$3,MAX($B$9:$B$1009),\"\"),\"\")","v":{"$error":"#REF!"}},{"$f":"IF($A9<$D$4,IF($A10>$D$4,MAX($B$9:$B$1009),\"\"),\"\")","v":{"$error":"#REF!"}}]
[{"$f":"+A9+$B$4","v":{"$error":"#REF!"}},{"$f":"_xlfn.CHISQ.DIST(A10,#REF!,FALSE)","v":{"$error":"#REF!"}},{"$error":"#REF!"},{"$error":"#REF!"}]
[{"$error":"#REF!"},{"$f":"_xlfn.CHISQ.DIST(A11,#REF!,FALSE)","v":{"$error":"#REF!"}},{"$error":"#REF!"},{"$error":"#REF!"}]
[{"$error":"#REF!"},{"$f":"_xlfn.CHISQ.DIST(A12,#REF!,FALSE)","v":{"$error":"#REF!"}},{"$error":"#REF!"},{"$error":"#REF!"}]
[{"$error":"#REF!"},{"$f":"_xlfn.CHISQ.DIST(A13,#REF!,FALSE)","v":{"$error":"#REF!"}},{"$error":"#REF!"},{"$error":"#REF!"}]
[{"$error":"#REF!"},{"$f":"_xlfn.CHISQ.DIST(A14,#REF!,FALSE)","v":{"$error":"#REF!"}},{"$error":"#REF!"},{"$error":"#REF!"}]
[{"$error":"#REF!"},{"$f":"_xlfn.CHISQ.DIST(A15,#REF!,FALSE)","v":{"$error":"#REF!"}},{"$error":"#REF!"},{"$error":"#REF!"}]
[{"$error":"#REF!"},{"$f":"_xlfn.CHISQ.DIST(A16,#REF!,FALSE)","v":{"$error":"#REF!"}},{"$error":"#REF!"},{"$error":"#REF!"}]
[{"$error":"#REF!"},{"$f":"_xlfn.CHISQ.DIST(A17,#REF!,FALSE)","v":{"$error":"#REF!"}},{"$error":"#REF!"},{"$error":"#REF!"}]
[{"$error":"#REF!"},{"$f":"_xlfn.CHISQ.DIST(A18,#REF!,FALSE)","v":{"$error":"#REF!"}},{"$error":"#REF!"},{"$error":"#REF!"}]
[{"$error":"#REF!"},{"$f":"_xlfn.CHISQ.DIST(A19,#REF!,FALSE)","v":{"$error":"#REF!"}},{"$error":"#REF!"},{"$error":"#REF!"}]
[{"$error":"#REF!"},{"$f":"_xlfn.CHISQ.DIST(A20,#REF!,FALSE)","v":{"$error":"#REF!"}},{"$error":"#REF!"},{"$error":"#REF!"}]
{"$rows_left_out":990}
{"sheet":"Regressionsanalyse","index":12,"n_rows":38,"n_cols":15,"rows_kept":38,"cut":false,"hidden":false,"merged":[[1,14,1,17],[1,4,1,8]]}
[null,"Forbedringsmuligheder","Opbakning"]
["USA",75,40,null,"Regressionsanalyse",null,null,null,null,null,null,null,null,null,"Tilbage til hovedmenuen"]
["Canada",75,61]
["Frankrig",44,48]
["Tyskland",61,56]
["Grækenland",24,16]
["Ungarn",39,45]
["Italien",32,29]
["Holland",79,64]
["Polen",73,51]
["Spanien",27,20]
["Sverige",80,69]
["Storbritannien",61,42]
["Rusland",46,44]
["Australien",77,59]
["Indien",73,54]
["Indonesien",89,65]
["Japan",54,40]
["Filippinerne",89,69]
["Israel",58,56]
{"$rows_left_out":19}
{"sheet":"Regressionssimulator","index":13,"n_rows":104,"n_cols":9,"rows_kept":104,"cut":false,"hidden":false,"merged":[[5,8,5,11],[0,0,0,12]]}
["R2-simulator"]
[]
[null,null,null,"Vælg den ønskede styrke ved at benytte rullefeltet i den grønne celle"]
["X","Y"]
[{"$f":"RANDBETWEEN(0,100)","v":99},{"$f":"IF($G$6=\"Ingen\", 'R-square_help'!A2,Regressionssimulator!A5*'R-square_help'!C2+'R-square_help'!B2)","v":199}]
[{"$f":"RANDBETWEEN(0,100)","v":91},{"$f":"IF($G$6=\"Ingen\", 'R-square_help'!A3,Regressionssimulator!A6*'R-square_help'!C3+'R-square_help'!B3)","v":191},null,null,null,"Styrke","Perfekt",null,"Tilbage til hovedmenuen"]
[72,{"$f":"IF($G$6=\"Ingen\", 'R-square_help'!A4,Regressionssimulator!A7*'R-square_help'!C4+'R-square_help'!B4)","v":172}]
[11,{"$f":"IF($G$6=\"Ingen\", 'R-square_help'!A5,Regressionssimulator!A8*'R-square_help'!C5+'R-square_help'!B5)","v":111},null,null,null,{"$f":"\"Korrelationskoefficient = \"&ROUND(CORREL(A4:A104,B4:B104),3)","v":"Korrelationskoefficient = 1"}]
[43,{"$f":"IF($G$6=\"Ingen\", 'R-square_help'!A6,Regressionssimulator!A9*'R-square_help'!C6+'R-square_help'!B6)","v":143}]
[90,{"$f":"IF($G$6=\"Ingen\", 'R-square_help'!A7,Regressionssimulator!A10*'R-square_help'!C7+'R-square_help'!B7)","v":190}]
[10,{"$f":"IF($G$6=\"Ingen\", 'R-square_help'!A8,Regressionssimulator!A11*'R-square_help'!C8+'R-square_help'!B8)","v":110}]
[98,{"$f":"IF($G$6=\"Ingen\", 'R-square_help'!A9,Regressionssimulator!A12*'R-square_help'!C9+'R-square_help'!B9)","v":198}]
[98,{"$f":"IF($G$6=\"Ingen\", 'R-square_help'!A10,Regressionssimulator!A13*'R-square_help'!C10+'R-square_help'!B10)","v":198}]
[65,{"$f":"IF($G$6=\"Ingen\", 'R-square_help'!A11,Regressionssimulator!A14*'R-square_help'!C11+'R-square_help'!B11)","v":165}]
[53,{"$f":"IF($G$6=\"Ingen\", 'R-square_help'!A12,Regressionssimulator!A15*'R-square_help'!C12+'R-square_help'!B12)","v":153}]
[62,{"$f":"IF($G$6=\"Ingen\", 'R-square_help'!A13,Regressionssimulator!A16*'R-square_help'!C13+'R-square_help'!B13)","v":162}]
[59,{"$f":"IF($G$6=\"Ingen\", 'R-square_help'!A14,Regressionssimulator!A17*'R-square_help'!C14+'R-square_help'!B14)","v":159}]
[65,{"$f":"IF($G$6=\"Ingen\", 'R-square_help'!A15,Regressionssimulator!A18*'R-square_help'!C15+'R-square_help'!B15)","v":165}]
[63,{"$f":"IF($G$6=\"Ingen\", 'R-square_help'!A16,Regressionssimulator!A19*'R-square_help'!C16+'R-square_help'!B16)","v":163}]
[31,{"$f":"IF($G$6=\"Ingen\", 'R-square_help'!A17,Regressionssimulator!A20*'R-square_help'!C17+'R-square_help'!B17)","v":131}]
{"$rows_left_out":85}
{"sheet":"R-square_help","index":14,"n_rows":101,"n_cols":7,"rows_kept":101,"cut":false,"hidden":true,"merged":[]}
["Random","Skæring","Hældning",null,null,"Skæring","Hældning"]
[{"$f":"RANDBETWEEN(0,100)","v":16},{"$f":"RANDBETWEEN($F$2,$F$3)","v":100},{"$f":"RANDBETWEEN($G$2,$G$3)/100","v":1},null,null,{"$f":"VLOOKUP(Regressionssimulator!$G$6,'R-square_help'!$F$8:$G$11,2,FALSE)","v":100},{"$f":"IF(Regressionssimulator!$G$6=\"Perfekt\",100,90)","v":100}]
[{"$f":"RANDBETWEEN(0,100)","v":40},{"$f":"RANDBETWEEN($F$2,$F$3)","v":100},{"$f":"RANDBETWEEN($G$2,$G$3)/100","v":1},null,null,100,100]
[36,100,1]
[40,100,1]
[35,100,1]
[7,100,1,null,null,"Ingen",0]
[83,100,1,null,null,"Svag",-40]
[48,100,1,null,null,"Moderat",50]
[74,100,1,null,null,"Stærk",90]
[63,100,1,null,null,"Perfekt",100]
[35,100,1]
[49,100,1]
[10,100,1]
[7,100,1]
[46,100,1]
[62,100,1]
[20,100,1]
[40,100,1]
[16,100,1]
{"$rows_left_out":81}