{"text_format":"1","workbook":"xlsx","n_sheets":15,"sheets":["Indhold","Vandret procentuering","Lodret procentuering","Vandret procentuering (2)","Lodret procentuering (2)","Vandret Indekstal","Lodret Indekstal","Vandret Vækstrate","Lodret Vækstrate","Stikprøveusikkerhed Andel","Måling vs valg","chi_help","Regressionsanalyse","Regressionssimulator","R-square_help"],"not_rendered":{"charts":5,"images":2,"macros":1,"external_links":2,"defined_names":59,"comments":0,"pivot_tables":0},"unopened":[],"bounds":{"document_bytes":16777216,"sheet_cells":100000,"rows_first":2000,"rows_last":500,"rows_between":2000,"halvings":0,"cell_chars":16384,"cell_head_chars":4096},"cells_cut":0,"cells_raw":0,"read":"whole","date_system":"1900"}

{"sheet":"Indhold","index":0,"n_rows":17,"n_cols":3,"rows_kept":17,"cut":false,"hidden":false,"merged":[]}
[]
[]
[null,"Den samfundsfaglige Regnemaskine"]
[]
[null,"Indhold","Relevans"]
[null,"1. Vandret procentuering af krydstabel","Ny ordning"]
[null,"2. Lodret procentuering af krydstabel","Ny ordning"]
[null,"3. Vandret procentuering af tidsserie","Ny ordning"]
[null,"4. Lodret procentuering af tidsserie","Ny ordning"]
[null,"5. Vandret Indekstal på tidsserie","Ny ordning"]
[null,"6. Lodret Indekstal på tidsserie","Ny ordning"]
[null,"7. Vandret vækstrate","Ny ordning"]
[null,"8. Lodret vækstrate","Ny ordning"]
[null,"9. Stikprøveusikkerhed (andele)","Ny ordning"]
[null,"10. Stikprøveusikkerhed (Måling vs. Valg)","Ny ordning"]
[null,"11. Regressionsanalyse","Ny ordning"]
[null,"12. Regressionssimulator","Ny ordning"]

{"sheet":"Vandret procentuering","index":1,"n_rows":53,"n_cols":21,"rows_kept":53,"cut":false,"hidden":false,"merged":[[0,20,0,23],[41,20,41,23],[4,2,4,17],[31,2,31,17],[33,0,52,0],[6,0,25,0]]}
["Vandret procentuering af krydstabel (Bruges når den uafhængige variabel er placeret i forspalten se illustration).",null,null,null,null,null,null,null,null,null,null,null,null,null,null,null,null,null,null,null,"Tilbage til hovedmenuen"]
[]
["Tabel 1: Absolutte tal"]
[]
[null,null,"Afhængig variabel"]
[null,null,"Kolonne 1","Kolonne 2","Kolonne 3","Kolonne 4","Kolonne 5","Kolonne 6","Kolonne 7","Kolonne 8","Kolonne 9","Kolonne 10","Kolonne 11","Kolonne 12","Kolonne 13","Kolonne 14","Kolonne 15","Kolonne 16","I alt"]
["Uafhængig variabel","Række 1",null,null,null,null,null,null,null,null,null,null,null,null,null,null,null,null,{"$f":"SUM(C7:R7)","v":0}]
[null,"Række 2",null,null,null,null,null,null,null,null,null,null,null,null,null,null,null,null,{"$f":"SUM(C8:R8)","v":0}]
[null,"Række 3",null,null,null,null,null,null,null,null,null,null,null,null,null,null,null,null,0]
[null,"Række 4",null,null,null,null,null,null,null,null,null,null,null,null,null,null,null,null,0]
[null,"Række 5",null,null,null,null,null,null,null,null,null,null,null,null,null,null,null,null,0]
[null,"Række 6",null,null,null,null,null,null,null,null,null,null,null,null,null,null,null,null,0]
[null,"Række 7",null,null,null,null,null,null,null,null,null,null,null,null,null,null,null,null,0]
[null,"Række 8",null,null,null,null,null,null,null,null,null,null,null,null,null,null,null,null,0]
[null,"Række 9",null,null,null,null,null,null,null,null,null,null,null,null,null,null,null,null,0]
[null,"Række 10",null,null,null,null,null,null,null,null,null,null,null,null,null,null,null,null,0]
[null,"Række 11",null,null,null,null,null,null,null,null,null,null,null,null,null,null,null,null,0]
[null,"Række 12",null,null,null,null,null,null,null,null,null,null,null,null,null,null,null,null,0]
[null,"Række 13",null,null,null,null,null,null,null,null,null,null,null,null,null,null,null,null,0]
[null,"Række 14",null,null,null,null,null,null,null,null,null,null,null,null,null,null,null,null,0]
[null,"Række 15",null,null,null,null,null,null,null,null,null,null,null,null,null,null,null,null,0]
[null,"Række 16",null,null,null,null,null,null,null,null,null,null,null,null,null,null,null,null,0]
[null,"Række 17",null,null,null,null,null,null,null,null,null,null,null,null,null,null,null,null,0]
[null,"Række 18",null,null,null,null,null,null,null,null,null,null,null,null,null,null,null,null,0]
[null,"Række 19",null,null,null,null,null,null,null,null,null,null,null,null,null,null,null,null,0]
[null,"Række 20",null,null,null,null,null,null,null,null,null,null,null,null,null,null,null,null,0]
[]
[]
[]
["Tabel 2: Rækkeprocenter"]
[]
[null,null,"Afhængig variabel"]
[null,null,"Kolonne 1","Kolonne 2","Kolonne 3","Kolonne 4","Kolonne 5","Kolonne 6","Kolonne 7","Kolonne 8","Kolonne 9","Kolonne 10","Kolonne 11","Kolonne 12","Kolonne 13","Kolonne 14","Kolonne 15","Kolonne 16","I alt"]
["Uafhængig variabel","Række 1",{"$f":"IF(C7=\"\",\"\",C7/$S7*100)","v":""},{"$f":"IF(D7=\"\",\"\",D7/$S7*100)","v":""},"","","","","","","","","","","","","","",{"$f":"SUM(C34:R34)","v":0}]
[null,"Række 2",{"$f":"IF(C8=\"\",\"\",C8/$S8*100)","v":""},"","","","","","","","","","","","","","","",{"$f":"SUM(C35:R35)","v":0}]
[null,"Række 3",{"$f":"IF(C9=\"\",\"\",C9/$S9*100)","v":""},"","","","","","","","","","","","","","","",0]
[null,"Række 4",{"$f":"IF(C10=\"\",\"\",C10/$S10*100)","v":""},"","","","","","","","","","","","","","","",0]
[null,"Række 5",{"$f":"IF(C11=\"\",\"\",C11/$S11*100)","v":""},"","","","","","","","","","","","","","","",0]
[null,"Række 6",{"$f":"IF(C12=\"\",\"\",C12/$S12*100)","v":""},"","","","","","","","","","","","","","","",0]
[null,"Række 7",{"$f":"IF(C13=\"\",\"\",C13/$S13*100)","v":""},"","","","","","","","","","","","","","","",0]
[null,"Række 8",{"$f":"IF(C14=\"\",\"\",C14/$S14*100)","v":""},"","","","","","","","","","","","","","","",0]
[null,"Række 9",{"$f":"IF(C15=\"\",\"\",C15/$S15*100)","v":""},"","","","","","","","","","","","","","","",0]
[null,"Række 10",{"$f":"IF(C16=\"\",\"\",C16/$S16*100)","v":""},"","","","","","","","","","","","","","","",0]
[null,"Række 11",{"$f":"IF(C17=\"\",\"\",C17/$S17*100)","v":""},"","","","","","","","","","","","","","","",0]
[null,"Række 12",{"$f":"IF(C18=\"\",\"\",C18/$S18*100)","v":""},"","","","","","","","","","","","","","","",0]
[null,"Række 13",{"$f":"IF(C19=\"\",\"\",C19/$S19*100)","v":""},"","","","","","","","","","","","","","","",0]
[null,"Række 14",{"$f":"IF(C20=\"\",\"\",C20/$S20*100)","v":""},"","","","","","","","","","","","","","","",0]
[null,"Række 15",{"$f":"IF(C21=\"\",\"\",C21/$S21*100)","v":""},"","","","","","","","","","","","","","","",0]
[null,"Række 16",{"$f":"IF(C22=\"\",\"\",C22/$S22*100)","v":""},"","","","","","","","","","","","","","","",0]
[null,"Række 17",{"$f":"IF(C23=\"\",\"\",C23/$S23*100)","v":""},"","","","","","","","","","","","","","","",0]
[null,"Række 18",{"$f":"IF(C24=\"\",\"\",C24/$S24*100)","v":""},"","","","","","","","","","","","","","","",0]
[null,"Række 19",{"$f":"IF(C25=\"\",\"\",C25/$S25*100)","v":""},"","","","","","","","","","","","","","","",0]
[null,"Række 20",{"$f":"IF(C26=\"\",\"\",C26/$S26*100)","v":""},"","","","","","","","","","","","","","","",0]

{"sheet":"Lodret procentuering","index":2,"n_rows":55,"n_cols":18,"rows_kept":55,"cut":false,"hidden":false,"merged":[[1,10,1,17],[5,2,5,11],[32,2,32,11],[7,0,26,0],[34,0,53,0]]}
["Lodret procentuering af krydstabel (Bruges når den uafhængige variabel er placeret i hovedspalten se illustration)."]
[null,null,null,null,null,null,null,null,null,null,"Tilbage til hovedmenuen"]
[]
["Tabel 1: Absolutte tal"]
[]
[null,null,"Uafhængig variabel"]
[null,null,"Kolonne 1","Kolonne 2","Kolonne 3","Kolonne 4","Kolonne 5","Kolonne 6","Kolonne 7","Kolonne 8","Kolonne 9","Kolonne 10","Kolonne 11","Kolonne 12","Kolonne 13","Kolonne 14","Kolonne 15","Kolonne 16"]
["Afhængig variabel","Række 1"]
[null,"Række 2"]
[null,"Række 3"]
[null,"Række 4"]
[null,"Række 5"]
[null,"Række 6"]
[null,"Række 7"]
[null,"Række 8"]
[null,"Række 9"]
[null,"Række 10"]
[null,"Række 11"]
[null,"Række 12"]
[null,"Række 13"]
[null,"Række 14"]
[null,"Række 15"]
[null,"Række 16"]
[null,"Række 17"]
[null,"Række 18"]
[null,"Række 19"]
[null,"Række 20"]
[null,"I alt",{"$f":"SUM(C8:C27)","v":0},{"$f":"SUM(D8:D27)","v":0},0,0,0,0,0,{"$f":"SUM(J8:J27)","v":0},0,0,0,0,0,0,0,0]
[]
[]
["Tabel 2: Rækkeprocenter"]
[]
[null,null,"Uafhængig variabel"]
[null,null,"Kolonne 1","Kolonne 2","Kolonne 3","Kolonne 4","Kolonne 5","Kolonne 6","Kolonne 7","Kolonne 8","Kolonne 9","Kolonne 10","Kolonne 11","Kolonne 12","Kolonne 13","Kolonne 14","Kolonne 15","Kolonne 16"]
["Afhængig variabel","Række 1",{"$f":"IF(C8=\"\",\"\",C8/C$28*100)","v":""},{"$f":"IF(D8=\"\",\"\",D8/D$28*100)","v":""},"","","","","","","","","","","","","",""]
[null,"Række 2",{"$f":"IF(C9=\"\",\"\",C9/C$28*100)","v":""},"","","","","","","","","","","","","","",""]
[null,"Række 3",{"$f":"IF(C10=\"\",\"\",C10/C$28*100)","v":""},"","","","","","","","","","","","","","",""]
[null,"Række 4",{"$f":"IF(C11=\"\",\"\",C11/C$28*100)","v":""},"","","","","","","","","","","","","","",""]
[null,"Række 5",{"$f":"IF(C12=\"\",\"\",C12/C$28*100)","v":""},"","","","","","","","","","","","","","",""]
[null,"Række 6",{"$f":"IF(C13=\"\",\"\",C13/C$28*100)","v":""},"","","","","","","","","","","","","","",""]
[null,"Række 7",{"$f":"IF(C14=\"\",\"\",C14/C$28*100)","v":""},"","","","","","","","","","","","","","",""]
[null,"Række 8",{"$f":"IF(C15=\"\",\"\",C15/C$28*100)","v":""},"","","","","","","","","","","","","","",""]
[null,"Række 9",{"$f":"IF(C16=\"\",\"\",C16/C$28*100)","v":""},"","","","","","","","","","","","","","",""]
[null,"Række 10",{"$f":"IF(C17=\"\",\"\",C17/C$28*100)","v":""},"","","","","","","","","","","","","","",""]
[null,"Række 11",{"$f":"IF(C18=\"\",\"\",C18/C$28*100)","v":""},"","","","","","","","","","","","","","",""]
[null,"Række 12",{"$f":"IF(C19=\"\",\"\",C19/C$28*100)","v":""},"","","","","","","","","","","","","","",""]
[null,"Række 13",{"$f":"IF(C20=\"\",\"\",C20/C$28*100)","v":""},"","","","","","","","","","","","","","",""]
[null,"Række 14",{"$f":"IF(C21=\"\",\"\",C21/C$28*100)","v":""},"","","","","","","","","","","","","","",""]
[null,"Række 15",{"$f":"IF(C22=\"\",\"\",C22/C$28*100)","v":""},"","","","","","","","","","","","","","",""]
[null,"Række 16",{"$f":"IF(C23=\"\",\"\",C23/C$28*100)","v":""},"","","","","","","","","","","","","","",""]
[null,"Række 17",{"$f":"IF(C24=\"\",\"\",C24/C$28*100)","v":""},"","","","","","","","","","","","","","",""]
[null,"Række 18",{"$f":"IF(C25=\"\",\"\",C25/C$28*100)","v":""},"","","","","","","","","","","","","","",""]
[null,"Række 19",{"$f":"IF(C26=\"\",\"\",C26/C$28*100)","v":""},"","","","","","","","","","","","","","",""]
[null,"Række 20",{"$f":"IF(C27=\"\",\"\",C27/C$28*100)","v":""},"","","","","","","","","","","","","","",""]
[null,"I alt",{"$f":"SUM(C35:C54)","v":0},{"$f":"SUM(D35:D54)","v":0},0,0,0,0,0,0,0,0,0,0,0,0,0,0]

{"sheet":"Vandret procentuering (2)","index":3,"n_rows":56,"n_cols":19,"rows_kept":56,"cut":false,"hidden":false,"merged":[[6,2,6,17],[8,0,28,0],[33,2,33,17],[35,0,55,0],[2,10,2,17]]}
["Vandret procentuering af tidsserie"]
[]
["Begyndelsesår",1,null,null,null,null,null,null,null,null,"Tilbage til hovedmenuen"]
[]
["Tabel 1: Absolutte tal"]
[]
[null,null,"Afhængig variabel"]
[null,null,"Kolonne 1","Kolonne 2","Kolonne 3","Kolonne 4","Kolonne 5","Kolonne 6","Kolonne 7","Kolonne 8","Kolonne 9","Kolonne 10","Kolonne 11","Kolonne 12","Kolonne 13","Kolonne 14","Kolonne 15","Kolonne 16","I alt"]
["Tid - Årstal",{"$f":"+$B$3","v":1},null,null,null,null,null,null,null,null,null,null,null,null,null,null,null,null,{"$f":"SUM(C9:R9)","v":0}]
[null,{"$f":"+B9+1","v":2},null,null,null,null,null,null,null,null,null,null,null,null,null,null,null,null,{"$f":"SUM(C10:R10)","v":0}]
[null,{"$f":"+B10+1","v":3},null,null,null,null,null,null,null,null,null,null,null,null,null,null,null,null,0]
[null,4,null,null,null,null,null,null,null,null,null,null,null,null,null,null,null,null,0]
[null,5,null,null,null,null,null,null,null,null,null,null,null,null,null,null,null,null,0]
[null,6,null,null,null,null,null,null,null,null,null,null,null,null,null,null,null,null,0]
[null,7,null,null,null,null,null,null,null,null,null,null,null,null,null,null,null,null,0]
[null,8,null,null,null,null,null,null,null,null,null,null,null,null,null,null,null,null,0]
[null,9,null,null,null,null,null,null,null,null,null,null,null,null,null,null,null,null,0]
[null,10,null,null,null,null,null,null,null,null,null,null,null,null,null,null,null,null,0]
[null,11,null,null,null,null,null,null,null,null,null,null,null,null,null,null,null,null,0]
[null,12,null,null,null,null,null,null,null,null,null,null,null,null,null,null,null,null,0]
[null,13,null,null,null,null,null,null,null,null,null,null,null,null,null,null,null,null,0]
[null,14,null,null,null,null,null,null,null,null,null,null,null,null,null,null,null,null,0]
[null,15,null,null,null,null,null,null,null,null,null,null,null,null,null,null,null,null,0]
[null,16,null,null,null,null,null,null,null,null,null,null,null,null,null,null,null,null,0]
[null,17,null,null,null,null,null,null,null,null,null,null,null,null,null,null,null,null,0]
[null,18,null,null,null,null,null,null,null,null,null,null,null,null,null,null,null,null,0]
[null,19,null,null,null,null,null,null,null,null,null,null,null,null,null,null,null,null,0]
[null,20,null,null,null,null,null,null,null,null,null,null,null,null,null,null,null,null,0]
[null,21,null,null,null,null,null,null,null,null,null,null,null,null,null,null,null,null,0]
[]
[]
["Tabel 2: Rækkeprocenter"]
[]
[null,null,"Afhængig variabel"]
[null,null,"Kolonne 1","Kolonne 2","Kolonne 3","Kolonne 4","Kolonne 5","Kolonne 6","Kolonne 7","Kolonne 8","Kolonne 9","Kolonne 10","Kolonne 11","Kolonne 12","Kolonne 13","Kolonne 14","Kolonne 15","Kolonne 16","I alt"]
["Tid - Årstal",{"$f":"+B9","v":1},{"$f":"IF(C9=\"\",\"\",C9/$S9*100)","v":""},{"$f":"IF(D9=\"\",\"\",D9/$S9*100)","v":""},"","","","","","","","","","","","","","",{"$f":"SUM(C36:R36)","v":0}]
[null,2,{"$f":"IF(C10=\"\",\"\",C10/$S10*100)","v":""},"","","","","","","","","","","","","","","",{"$f":"SUM(C37:R37)","v":0}]
[null,3,{"$f":"IF(C11=\"\",\"\",C11/$S11*100)","v":""},"","","","","","","","","","","","","","","",0]
[null,4,{"$f":"IF(C12=\"\",\"\",C12/$S12*100)","v":""},"","","","","","","","","","","","","","","",0]
[null,5,{"$f":"IF(C13=\"\",\"\",C13/$S13*100)","v":""},"","","","","","","","","","","","","","","",0]
[null,6,{"$f":"IF(C14=\"\",\"\",C14/$S14*100)","v":""},"","","","","","","","","","","","","","","",0]
[null,7,{"$f":"IF(C15=\"\",\"\",C15/$S15*100)","v":""},"","","","","","","","","","","","","","","",0]
[null,8,{"$f":"IF(C16=\"\",\"\",C16/$S16*100)","v":""},"","","","","","","","","","","","","","","",0]
[null,9,{"$f":"IF(C17=\"\",\"\",C17/$S17*100)","v":""},"","","","","","","","","","","","","","","",0]
[null,10,{"$f":"IF(C18=\"\",\"\",C18/$S18*100)","v":""},"","","","","","","","","","","","","","","",0]
[null,11,{"$f":"IF(C19=\"\",\"\",C19/$S19*100)","v":""},"","","","","","","","","","","","","","","",0]
[null,{"$f":"+B20","v":12},{"$f":"IF(C20=\"\",\"\",C20/$S20*100)","v":""},"","","","","","","","","","","","","","","",0]
[null,13,{"$f":"IF(C21=\"\",\"\",C21/$S21*100)","v":""},"","","","","","","","","","","","","","","",0]
[null,14,{"$f":"IF(C22=\"\",\"\",C22/$S22*100)","v":""},"","","","","","","","","","","","","","","",0]
[null,15,{"$f":"IF(C23=\"\",\"\",C23/$S23*100)","v":""},"","","","","","","","","","","","","","","",0]
[null,16,{"$f":"IF(C24=\"\",\"\",C24/$S24*100)","v":""},"","","","","","","","","","","","","","","",0]
[null,17,{"$f":"IF(C25=\"\",\"\",C25/$S25*100)","v":""},"","","","","","","","","","","","","","","",0]
[null,18,{"$f":"IF(C26=\"\",\"\",C26/$S26*100)","v":""},"","","","","","","","","","","","","","","",0]
[null,19,{"$f":"IF(C27=\"\",\"\",C27/$S27*100)","v":""},"","","","","","","","","","","","","","","",0]
[null,20,{"$f":"IF(C28=\"\",\"\",C28/$S28*100)","v":""},"","","","","","","","","","","","","","","",0]
[null,21,{"$f":"IF(C29=\"\",\"\",C29/$S29*100)","v":""},"","","","","","","","","","","","","","","",0]

{"sheet":"Lodret procentuering (2)","index":4,"n_rows":56,"n_cols":19,"rows_kept":56,"cut":false,"hidden":false,"merged":[[8,0,27,0],[35,0,54,0],[1,9,1,14],[6,2,6,18],[33,2,33,18]]}
["Lodret procentuering af tidsserie"]
[null,null,null,null,null,null,null,null,null,"Tilbage til hovedmenuen"]
["Begyndelsesår"]
[]
["Tabel 1: Absolutte tal"]
[]
[null,null,"Tid - Årstal"]
[null,null,{"$f":"+$B$3","v":0},{"$f":"+C8+1","v":1},{"$f":"+D8+1","v":2},3,4,5,6,7,8,9,10,11,12,{"$f":"+O8+1","v":13},{"$f":"+P8+1","v":14},{"$f":"+Q8+1","v":15},{"$f":"+R8+1","v":16}]
["Afhængig variabel","Række 1"]
[null,"Række 2"]
[null,"Række 3"]
[null,"Række 4"]
[null,"Række 5"]
[null,"Række 6"]
[null,"Række 7"]
[null,"Række 8"]
[null,"Række 9"]
[null,"Række 10"]
[null,"Række 11"]
[null,"Række 12"]
[null,"Række 13"]
[null,"Række 14"]
[null,"Række 15"]
[null,"Række 16"]
[null,"Række 17"]
[null,"Række 18"]
[null,"Række 19"]
[null,"Række 20"]
[null,"I alt",{"$f":"SUM(C9:C28)","v":0},{"$f":"SUM(D9:D28)","v":0},0,0,0,0,0,0,0,0,0,0,0,0,0,0,0]
[]
[]
["Tabel 2: Kolonneprocenter"]
[]
[null,null,"Tid - Årstal"]
[null,null,{"$f":"+C8","v":0},1,2,3,4,5,6,7,8,9,10,11,12,13,14,15,16]
["Afhængig variabel","Række 1",{"$f":"IF(C9=\"\",\"\",C9/C$29*100)","v":""},{"$f":"IF(D9=\"\",\"\",D9/D$29*100)","v":""},"","","","","","","","","","","","","","",""]
[null,"Række 2",{"$f":"IF(C10=\"\",\"\",C10/C$29*100)","v":""},"","","","","","","","","","","","","","","",""]
[null,"Række 3",{"$f":"IF(C11=\"\",\"\",C11/C$29*100)","v":""},"","","","","","","","","","","","","","","",""]
[null,"Række 4",{"$f":"IF(C12=\"\",\"\",C12/C$29*100)","v":""},"","","","","","","","","","","","","","","",""]
[null,"Række 5",{"$f":"IF(C13=\"\",\"\",C13/C$29*100)","v":""},"","","","","","","","","","","","","","","",""]
[null,"Række 6",{"$f":"IF(C14=\"\",\"\",C14/C$29*100)","v":""},"","","","","","","","","","","","","","","",""]
[null,"Række 7",{"$f":"IF(C15=\"\",\"\",C15/C$29*100)","v":""},"","","","","","","","","","","","","","","",""]
[null,"Række 8",{"$f":"IF(C16=\"\",\"\",C16/C$29*100)","v":""},"","","","","","","","","","","","","","","",""]
[null,"Række 9",{"$f":"IF(C17=\"\",\"\",C17/C$29*100)","v":""},"","","","","","","","","","","","","","","",""]
[null,"Række 10",{"$f":"IF(C18=\"\",\"\",C18/C$29*100)","v":""},"","","","","","","","","","","","","","","",""]
[null,"Række 11",{"$f":"IF(C19=\"\",\"\",C19/C$29*100)","v":""},"","","","","","","","","","","","","","","",""]
[null,"Række 12",{"$f":"IF(C20=\"\",\"\",C20/C$29*100)","v":""},"","","","","","","","","","","","","","","",""]
[null,"Række 13",{"$f":"IF(C21=\"\",\"\",C21/C$29*100)","v":""},"","","","","","","","","","","","","","","",""]
[null,"Række 14",{"$f":"IF(C22=\"\",\"\",C22/C$29*100)","v":""},"","","","","","","","","","","","","","","",""]
[null,"Række 15",{"$f":"IF(C23=\"\",\"\",C23/C$29*100)","v":""},"","","","","","","","","","","","","","","",""]
[null,"Række 16",{"$f":"IF(C24=\"\",\"\",C24/C$29*100)","v":""},"","","","","","","","","","","","","","","",""]
[null,"Række 17",{"$f":"IF(C25=\"\",\"\",C25/C$29*100)","v":""},"","","","","","","","","","","","","","","",""]
[null,"Række 18",{"$f":"IF(C26=\"\",\"\",C26/C$29*100)","v":""},"","","","","","","","","","","","","","","",""]
[null,"Række 19",{"$f":"IF(C27=\"\",\"\",C27/C$29*100)","v":""},"","","","","","","","","","","","","","","",""]
[null,"Række 20",{"$f":"IF(C28=\"\",\"\",C28/C$29*100)","v":""},"","","","","","","","","","","","","","","",""]
[null,"I alt",{"$f":"SUM(C36:C55)","v":0},{"$f":"SUM(D36:D55)","v":0},0,0,0,0,0,0,0,0,0,0,0,0,0,0,0]

{"sheet":"Vandret Indekstal","index":5,"n_rows":54,"n_cols":19,"rows_kept":54,"cut":false,"hidden":false,"merged":[[1,9,1,14],[7,0,26,0],[34,0,53,0],[5,2,5,18],[32,2,32,18]]}
["Vandret indekstal på tidsserie"]
[null,null,null,null,null,null,null,null,null,"Tilbage til hovedmenuen"]
["Tabel 1: Absolutte tal"]
[]
["Begyndelsesår"]
[null,null,"Tid - År"]
[null,null,{"$f":"+$B$5","v":0},{"$f":"+C7+1","v":1},{"$f":"+D7+1","v":2},3,4,5,6,7,8,9,{"$f":"+L7+1","v":10},{"$f":"+M7+1","v":11},{"$f":"+N7+1","v":12},{"$f":"+O7+1","v":13},{"$f":"+P7+1","v":14},{"$f":"+Q7+1","v":15},{"$f":"+R7+1","v":16}]
["Afhængig variabel","Række 1",894,914,908,890,882,883,877]
[null,"Række 2",2635,2521,2503,2499,2487,2497,2524]
[null,"Række 3",4573,4592,5608,11159,14707,11141,9582]
[null,"Række 4",11449,12946,11837,13297,15389,17725,20102]
[null,"Række 5",20132,25157,39635,72192,136806,200023,266449]
[null,"Række 6",46552,38471,17257,30549,48218,68378,64144]
[null,"Række 7",22558,23244,28562,32892,52568,84772,62525]
[null,"Række 8",55904,49089,43891,53568,59766,50996,49916]
[null,"Række 9",6750,9534,13217,10782,11385,11955,20796]
[null,"Række 10",61531,47851,45495,42223,44074,41032,51190]
[null,"Række 11",651972,521923,449369,655407,826247,687112,718689]
[null,"Række 12",1515685,1135277,1076758,1383821,1753261,1742601,1914432]
[null,"Række 13"]
[null,"Række 14"]
[null,"Række 15"]
[null,"Række 16"]
[null,"Række 17"]
[null,"Række 18"]
[null,"Række 19"]
[null,"Række 20"]
[]
[]
[]
["Tabel 2: Indekstal (År 0=100)"]
[]
[null,null,"Tid - År"]
[null,null,{"$f":"+C7","v":0},{"$f":"+D7","v":1},2,3,4,5,6,7,8,9,10,11,12,13,14,15,16]
["Afhængig variabel","Række 1",{"$f":"IF(C8=\"\",\"\",C8/$C8*100)","v":100},{"$f":"IF(D8=\"\",\"\",D8/$C8*100)","v":102.23713646532437},101.56599552572708,99.552572706935123,98.65771812080537,98.769574944071593,98.098434004474271,"","","","","","","","","",""]
[null,"Række 2",{"$f":"IF(C9=\"\",\"\",C9/$C9*100)","v":100},95.673624288425046,94.990512333965853,94.838709677419359,94.383301707779893,94.762808349146113,95.787476280834909,"","","","","","","","","",""]
[null,"Række 3",{"$f":"IF(C10=\"\",\"\",C10/$C10*100)","v":100},100.41548217800131,122.63284495954517,244.01924338508638,321.60507325606824,243.62562869013775,209.53422261097751,"","","","","","","","","",""]
[null,"Række 4",{"$f":"IF(C11=\"\",\"\",C11/$C11*100)","v":100},113.07537776224999,103.38894226570005,116.14114769848895,134.41348589396455,154.81701458642675,175.578653157481,"","","","","","","","","",""]
[null,"Række 5",{"$f":"IF(C12=\"\",\"\",C12/$C12*100)","v":100},124.96026226902444,196.87562090204648,358.59328432346513,679.54500298032985,993.55752036558704,1323.5098350884166,"","","","","","","","","",""]
[null,"Række 6",{"$f":"IF(C13=\"\",\"\",C13/$C13*100)","v":100},82.640917683450766,37.070372916308642,65.623388898436147,103.578793607149,146.88520364323767,137.78999828149165,"","","","","","","","","",""]
[null,"Række 7",{"$f":"IF(C14=\"\",\"\",C14/$C14*100)","v":100},103.04104973845199,126.61583473712209,145.81079882968348,233.03484351449595,375.79572657150459,277.17439489316428,"","","","","","","","","",""]
[null,"Række 8",{"$f":"IF(C15=\"\",\"\",C15/$C15*100)","v":100},87.809459072696043,78.511376645678311,95.821408128219815,106.90827132226674,91.220663995420722,89.288780767029195,"","","","","","","","","",""]
[null,"Række 9",{"$f":"IF(C16=\"\",\"\",C16/$C16*100)","v":100},141.24444444444444,195.8074074074074,159.73333333333332,168.66666666666669,177.11111111111111,308.0888888888889,"","","","","","","","","",""]
[null,"Række 10",{"$f":"IF(C17=\"\",\"\",C17/$C17*100)","v":100},77.767304285644627,73.938340023727875,68.620695259300192,71.628935008369766,66.685085566624963,83.193837252766897,"","","","","","","","","",""]
[null,"Række 11",{"$f":"IF(C18=\"\",\"\",C18/$C18*100)","v":100},80.052977735240162,68.924585718405083,100.52686311682098,126.73044241163731,105.38980201603749,110.23310817028953,"","","","","","","","","",""]
[null,"Række 12",{"$f":"IF(C19=\"\",\"\",C19/$C19*100)","v":100},74.901909037827778,71.041014458809045,91.300039256177897,115.67449700960293,114.97118464588618,126.30803893948941,"","","","","","","","","",""]
[null,"Række 13",{"$f":"IF(C20=\"\",\"\",C20/$C20*100)","v":""},"","","","","","","","","","","","","","","",""]
[null,"Række 14",{"$f":"IF(C21=\"\",\"\",C21/$C21*100)","v":""},"","","","","","","","","","","","","","","",""]
[null,"Række 15",{"$f":"IF(C22=\"\",\"\",C22/$C22*100)","v":""},"","","","","","","","","","","","","","","",""]
[null,"Række 16",{"$f":"IF(C23=\"\",\"\",C23/$C23*100)","v":""},"","","","","","","","","","","","","","","",""]
[null,"Række 17",{"$f":"IF(C24=\"\",\"\",C24/$C24*100)","v":""},"","","","","","","","","","","","","","","",""]
[null,"Række 18",{"$f":"IF(C25=\"\",\"\",C25/$C25*100)","v":""},"","","","","","","","","","","","","","","",""]
[null,"Række 19",{"$f":"IF(C26=\"\",\"\",C26/$C26*100)","v":""},"","","","","","","","","","","","","","","",""]
[null,"Række 20",{"$f":"IF(C27=\"\",\"\",C27/$C27*100)","v":""},"","","","","","","","","","","","","","","",""]

{"sheet":"Lodret Indekstal","index":6,"n_rows":57,"n_cols":18,"rows_kept":57,"cut":false,"hidden":false,"merged":[[8,0,28,0],[36,0,56,0],[2,11,2,18],[6,2,6,17],[34,2,34,17]]}
["Lodret indekstal på tidsserie"]
[]
["Tabel 1: Absolutte tal",null,null,null,null,null,null,null,null,null,null,"Tilbage til hovedmenuen"]
[]
["Begyndelsesår"]
[]
[null,null,"Afhængig variabel"]
[null,null,"Kolonne 1","Kolonne 2","Kolonne 3","Kolonne 4","Kolonne 5","Kolonne 6","Kolonne 7","Kolonne 8","Kolonne 9","Kolonne 10","Kolonne 11","Kolonne 12","Kolonne 13","Kolonne 14","Kolonne 15","Kolonne 16"]
["Tid - År",{"$f":"+$B$5","v":0}]
[null,{"$f":"+B9+1","v":1}]
[null,{"$f":"+B10+1","v":2}]
[null,3]
[null,4]
[null,5]
[null,6]
[null,7]
[null,8]
[null,9]
[null,10]
[null,11]
[null,12]
[null,13]
[null,14]
[null,15]
[null,16]
[null,17]
[null,18]
[null,19]
[null,20]
[]
[]
[]
["Tabel 2: Indekstal (År 1=100)"]
[]
[null,null,"Afhængig variabel"]
[null,null,"Kolonne 1","Kolonne 2","Kolonne 3","Kolonne 4","Kolonne 5","Kolonne 6","Kolonne 7","Kolonne 8","Kolonne 9","Kolonne 10","Kolonne 11","Kolonne 12","Kolonne 13","Kolonne 14","Kolonne 15","Kolonne 16"]
["Tid - År",{"$f":"+B9","v":0},{"$f":"IF(C9=\"\",\"\",C9/C$9*100)","v":""},{"$f":"IF(D9=\"\",\"\",D9/D$9*100)","v":""},"","","","","","","","","","","","","",""]
[null,{"$f":"+B10","v":1},{"$f":"IF(C10=\"\",\"\",C10/C$9*100)","v":""},"","","","","","","","","","","","","","",""]
[null,{"$f":"+B11","v":2},{"$f":"IF(C11=\"\",\"\",C11/C$9*100)","v":""},"","","","","","","","","","","","","","",""]
[null,{"$f":"+B12","v":3},{"$f":"IF(C12=\"\",\"\",C12/C$9*100)","v":""},"","","","","","","","","","","","","","",""]
[null,4,{"$f":"IF(C13=\"\",\"\",C13/C$9*100)","v":""},"","","","","","","","","","","","","","",""]
[null,5,{"$f":"IF(C14=\"\",\"\",C14/C$9*100)","v":""},"","","","","","","","","","","","","","",""]
[null,6,{"$f":"IF(C15=\"\",\"\",C15/C$9*100)","v":""},"","","","","","","","","","","","","","",""]
[null,7,{"$f":"IF(C16=\"\",\"\",C16/C$9*100)","v":""},"","","","","","","","","","","","","","",""]
[null,8,{"$f":"IF(C17=\"\",\"\",C17/C$9*100)","v":""},"","","","","","","","","","","","","","",""]
[null,9,{"$f":"IF(C18=\"\",\"\",C18/C$9*100)","v":""},"","","","","","","","","","","","","","",""]
[null,10,{"$f":"IF(C19=\"\",\"\",C19/C$9*100)","v":""},"","","","","","","","","","","","","","",""]
[null,11,{"$f":"IF(C20=\"\",\"\",C20/C$9*100)","v":""},"","","","","","","","","","","","","","",""]
[null,12,{"$f":"IF(C21=\"\",\"\",C21/C$9*100)","v":""},"","","","","","","","","","","","","","",""]
[null,13,{"$f":"IF(C22=\"\",\"\",C22/C$9*100)","v":""},"","","","","","","","","","","","","","",""]
[null,14,{"$f":"IF(C23=\"\",\"\",C23/C$9*100)","v":""},"","","","","","","","","","","","","","",""]
[null,15,{"$f":"IF(C24=\"\",\"\",C24/C$9*100)","v":""},"","","","","","","","","","","","","","",""]
[null,16,{"$f":"IF(C25=\"\",\"\",C25/C$9*100)","v":""},"","","","","","","","","","","","","","",""]
[null,17,{"$f":"IF(C26=\"\",\"\",C26/C$9*100)","v":""},"","","","","","","","","","","","","","",""]
[null,18,{"$f":"IF(C27=\"\",\"\",C27/C$9*100)","v":""},"","","","","","","","","","","","","","",""]
[null,19,{"$f":"IF(C28=\"\",\"\",C28/C$9*100)","v":""},"","","","","","","","","","","","","","",""]
[null,20,{"$f":"IF(C29=\"\",\"\",C29/C$9*100)","v":""},"","","","","","","","","","","","","","",""]

{"sheet":"Vandret Vækstrate","index":7,"n_rows":56,"n_cols":19,"rows_kept":56,"cut":false,"hidden":false,"merged":[[7,2,7,18],[9,0,28,0],[34,2,34,18],[36,0,55,0],[2,10,2,15]]}
["Vandret Vækstrate"]
[]
[null,null,null,null,null,null,null,null,null,null,"Tilbage til hovedmenuen"]
["Tabel 1: Absolutte tal"]
[]
["Begyndelsesår"]
[]
[null,null,"Tid - År"]
[null,null,{"$f":"+$B$6","v":0},{"$f":"+C9+1","v":1},{"$f":"+D9+1","v":2},3,4,5,6,7,8,9,{"$f":"+L9+1","v":10},{"$f":"+M9+1","v":11},{"$f":"+N9+1","v":12},{"$f":"+O9+1","v":13},{"$f":"+P9+1","v":14},{"$f":"+Q9+1","v":15},{"$f":"+R9+1","v":16}]
["Afhængig variabel","Række 1"]
[null,"Række 2"]
[null,"Række 3"]
[null,"Række 4"]
[null,"Række 5"]
[null,"Række 6"]
[null,"Række 7"]
[null,"Række 8"]
[null,"Række 9"]
[null,"Række 10"]
[null,"Række 11"]
[null,"Række 12"]
[null,"Række 13"]
[null,"Række 14"]
[null,"Række 15"]
[null,"Række 16"]
[null,"Række 17"]
[null,"Række 18"]
[null,"Række 19"]
[null,"Række 20"]
[]
[]
[]
["Tabel 2: Årlig procentvis vækstrate"]
[]
[null,null,"Tid - År"]
[null,null,{"$f":"+C9","v":0},{"$f":"+D9","v":1},2,3,4,5,6,7,8,9,10,11,12,13,14,15,16]
["Afhængig variabel","Række 1","--",{"$f":"IF(D10=\"\",\"\",((D10-C10)/C10)*100)","v":""},{"$f":"IF(E10=\"\",\"\",((E10-D10)/D10)*100)","v":""},"","","","","","","","","","","","","",""]
[null,"Række 2","--",{"$f":"IF(D11=\"\",\"\",((D11-C11)/C11)*100)","v":""},"","","","","","","","","","","","","","",""]
[null,"Række 3","--",{"$f":"IF(D12=\"\",\"\",((D12-C12)/C12)*100)","v":""},"","","","","","","","","","","","","","",""]
[null,"Række 4","--",{"$f":"IF(D13=\"\",\"\",((D13-C13)/C13)*100)","v":""},"","","","","","","","","","","","","","",""]
[null,"Række 5","--",{"$f":"IF(D14=\"\",\"\",((D14-C14)/C14)*100)","v":""},"","","","","","","","","","","","","","",""]
[null,"Række 6","--",{"$f":"IF(D15=\"\",\"\",((D15-C15)/C15)*100)","v":""},"","","","","","","","","","","","","","",""]
[null,"Række 7","--",{"$f":"IF(D16=\"\",\"\",((D16-C16)/C16)*100)","v":""},"","","","","","","","","","","","","","",""]
[null,"Række 8","--",{"$f":"IF(D17=\"\",\"\",((D17-C17)/C17)*100)","v":""},"","","","","","","","","","","","","","",""]
[null,"Række 9","--",{"$f":"IF(D18=\"\",\"\",((D18-C18)/C18)*100)","v":""},"","","","","","","","","","","","","","",""]
[null,"Række 10","--",{"$f":"IF(D19=\"\",\"\",((D19-C19)/C19)*100)","v":""},"","","","","","","","","","","","","","",""]
[null,"Række 11","--",{"$f":"IF(D20=\"\",\"\",((D20-C20)/C20)*100)","v":""},"","","","","","","","","","","","","","",""]
[null,"Række 12","--",{"$f":"IF(D21=\"\",\"\",((D21-C21)/C21)*100)","v":""},"","","","","","","","","","","","","","",""]
[null,"Række 13","--",{"$f":"IF(D22=\"\",\"\",((D22-C22)/C22)*100)","v":""},"","","","","","","","","","","","","","",""]
[null,"Række 14","--",{"$f":"IF(D23=\"\",\"\",((D23-C23)/C23)*100)","v":""},"","","","","","","","","","","","","","",""]
[null,"Række 15","--",{"$f":"IF(D24=\"\",\"\",((D24-C24)/C24)*100)","v":""},"","","","","","","","","","","","","","",""]
[null,"Række 16","--",{"$f":"IF(D25=\"\",\"\",((D25-C25)/C25)*100)","v":""},"","","","","","","","","","","","","","",""]
[null,"Række 17","--",{"$f":"IF(D26=\"\",\"\",((D26-C26)/C26)*100)","v":""},"","","","","","","","","","","","","","",""]
[null,"Række 18","--",{"$f":"IF(D27=\"\",\"\",((D27-C27)/C27)*100)","v":""},"","","","","","","","","","","","","","",""]
[null,"Række 19","--",{"$f":"IF(D28=\"\",\"\",((D28-C28)/C28)*100)","v":""},"","","","","","","","","","","","","","",""]
[null,"Række 20","--",{"$f":"IF(D29=\"\",\"\",((D29-C29)/C29)*100)","v":""},"","","","","","","","","","","","","","",""]

{"sheet":"Lodret Vækstrate","index":8,"n_rows":57,"n_cols":18,"rows_kept":57,"cut":false,"hidden":false,"merged":[[9,0,29,0],[37,0,56,0],[2,11,2,18],[35,2,35,17],[7,2,7,17]]}
["Lodret Vækstrate"]
[]
[null,null,null,null,null,null,null,null,null,null,null,"Tilbage til hovedmenuen"]
["Tabel 1: Absolutte tal"]
[]
["Begyndelsesår"]
[]
[null,null,"Afhængig variabel"]
[null,null,"Kolonne 1","Kolonne 2","Kolonne 3","Kolonne 4","Kolonne 5","Kolonne 6","Kolonne 7","Kolonne 8","Kolonne 9","Kolonne 10","Kolonne 11","Kolonne 12","Kolonne 13","Kolonne 14","Kolonne 15","Kolonne 16"]
["Tid - År",{"$f":"+$B$6","v":0}]
[null,{"$f":"+B10+1","v":1}]
[null,{"$f":"+B11+1","v":2}]
[null,3]
[null,4]
[null,5]
[null,6]
[null,7]
[null,8]
[null,9]
[null,10]
[null,11]
[null,12]
[null,13]
[null,14]
[null,15]
[null,16]
[null,17]
[null,18]
[null,19]
[null,20]
[]
[]
[]
["Tabel 2: Årlig procentvis vækstrate"]
[]
[null,null,"Afhængig variabel"]
[null,null,"Kolonne 1","Kolonne 2","Kolonne 3","Kolonne 4","Kolonne 5","Kolonne 6","Kolonne 7","Kolonne 8","Kolonne 9","Kolonne 10","Kolonne 11","Kolonne 12","Kolonne 13","Kolonne 14","Kolonne 15","Kolonne 16"]
["Tid - År",{"$f":"+B10","v":0},"-- ","-- ","-- ","-- ","-- ","-- ","-- ","-- ","-- ","-- ","-- ","-- ","-- ","-- ","-- ","-- "]
[null,1,{"$f":"IF(C11=\"\",\"\",((C11-C10)/C10)*100)","v":""},{"$f":"IF(D11=\"\",\"\",((D11-D10)/D10)*100)","v":""},"","","","","","","","","","","","","",""]
[null,2,{"$f":"IF(C12=\"\",\"\",((C12-C11)/C11)*100)","v":""},"","","","","","","","","","","","","","",""]
[null,3,{"$f":"IF(C13=\"\",\"\",((C13-C12)/C12)*100)","v":""},"","","","","","","","","","","","","","",""]
[null,4,{"$f":"IF(C14=\"\",\"\",((C14-C13)/C13)*100)","v":""},"","","","","","","","","","","","","","",""]
[null,5,{"$f":"IF(C15=\"\",\"\",((C15-C14)/C14)*100)","v":""},"","","","","","","","","","","","","","",""]
[null,6,{"$f":"IF(C16=\"\",\"\",((C16-C15)/C15)*100)","v":""},"","","","","","","","","","","","","","",""]
[null,7,{"$f":"IF(C17=\"\",\"\",((C17-C16)/C16)*100)","v":""},"","","","","","","","","","","","","","",""]
[null,8,{"$f":"IF(C18=\"\",\"\",((C18-C17)/C17)*100)","v":""},"","","","","","","","","","","","","","",""]
[null,9,{"$f":"IF(C19=\"\",\"\",((C19-C18)/C18)*100)","v":""},"","","","","","","","","","","","","","",""]
[null,10,{"$f":"IF(C20=\"\",\"\",((C20-C19)/C19)*100)","v":""},"","","","","","","","","","","","","","",""]
[null,{"$f":"+B21","v":11},{"$f":"IF(C21=\"\",\"\",((C21-C20)/C20)*100)","v":""},"","","","","","","","","","","","","","",""]
[null,12,{"$f":"IF(C22=\"\",\"\",((C22-C21)/C21)*100)","v":""},"","","","","","","","","","","","","","",""]
[null,13,{"$f":"IF(C23=\"\",\"\",((C23-C22)/C22)*100)","v":""},"","","","","","","","","","","","","","",""]
[null,14,{"$f":"IF(C24=\"\",\"\",((C24-C23)/C23)*100)","v":""},"","","","","","","","","","","","","","",""]
[null,15,{"$f":"IF(C25=\"\",\"\",((C25-C24)/C24)*100)","v":""},"","","","","","","","","","","","","","",""]
[null,16,{"$f":"IF(C26=\"\",\"\",((C26-C25)/C25)*100)","v":""},"","","","","","","","","","","","","","",""]
[null,17,{"$f":"IF(C27=\"\",\"\",((C27-C26)/C26)*100)","v":""},"","","","","","","","","","","","","","",""]
[null,18,{"$f":"IF(C28=\"\",\"\",((C28-C27)/C27)*100)","v":""},"","","","","","","","","","","","","","",""]
[null,19,{"$f":"IF(C29=\"\",\"\",((C29-C28)/C28)*100)","v":""},"","","","","","","","","","","","","","",""]

{"sheet":"Stikprøveusikkerhed Andel","index":9,"n_rows":20,"n_cols":12,"rows_kept":20,"cut":false,"hidden":false,"merged":[[14,0,14,3],[0,11,0,14],[21,10,26,19]]}
["Konfidensinterval for populationsandel",null,null,null,null,null,null,null,null,null,null,"Tilbage til hovedmenuen"]
[]
[]
[null,null,null,null,null,null,null,null,{"$f":"+B6*(B7/100)","v":206.36}]
["Sikkerhedsniveau",0.95,"1-a","Forudsætning:",null,null,null,null,{"$f":"+B6*(1-(B7/100))","v":1333.64}]
["Stikprøvestørrelse",1540,"n","Både np og  n(1-p) er >= 5"]
["Stikprøveandel",13.4,"p-hat",{"$f":"IF(MIN(I4:I5)<5,\"Stikprøven er for lille :-(\",\"Stikprøven er stor nok :-)\")","v":"Stikprøven er stor nok :-)"}]
[]
[]
["Konfidensinterval",{"$f":"B7","v":13.4},"±",{"$f":"-NORMSINV((1-$B$5)/2)*SQRT(B7*(100-B7)/B6)","v":1.7013711952663375}," = ","[",{"$f":"B10-D10","v":11.698628804733662},",",{"$f":"B10+D10","v":15.101371195266339},"]"]
[]
["Sammenligningsværdi",21.1]
[]
[]
["Tilbage til hovedmenuen"]
[]
["Konfidensinterval"]
["KI Lav",{"$f":"+G10","v":11.698628804733662},1.5]
["KI Høj",{"$f":"+I10","v":15.101371195266339},1.5]
["Sammenligningsværdi",{"$f":"+B12","v":21.1},1.5]

{"sheet":"Måling vs valg","index":10,"n_rows":48,"n_cols":19,"rows_kept":48,"cut":false,"hidden":false,"merged":[[0,0,0,10],[2,5,2,6],[1,16,1,19]]}
["Stikprøveusikkerhed og meningsmålinger"]
[null,null,null,null,null,null,null,null,null,null,null,null,null,null,null,null,"Tilbage til hovedmenuen"]
[null,"FV 2019","Måling","Difference","Usikkerheds-","Konfidensinterval",null,null,"Test","P-værdi","Signifikant","Signifikant","Signifikant","Signifikant","Signifikant"]
["Parti","Procent","Procent","Procentpoint","margin","Nedre","Øvre","Konfidensinterval","størrelse",null,"ændring?","fremgang","tilbagegang","over spærregrænsen?","under spærregrænsen?"]
["Socialdemokratiet",27.5,20.8,{"$f":"+C5-B5","v":-6.6999999999999993},{"$f":"NORMINV($B$29+(1-$B$29)/2,0,1)*(C5*(100-C5)/$B$26)^0.5","v":1.8781536990059042},{"$f":"ROUND(+C5-E5,1)","v":18.899999999999999},{"$f":"ROUND(+C5+E5,1)","v":22.7},{"$f":"\"[ \"&F5&\"; \"&G5&\" ]\"","v":"[ 18,9; 22,7 ]"},{"$f":"IF(C5/100=0,\"\",(C5/100-B5/100)/((C5/100*(1-C5/100)/$B$26))^0.5)","v":-6.9918445457200455},{"$f":"(IF(I5>0,1-_xlfn.NORM.DIST(I5,0,1,TRUE),_xlfn.NORM.DIST(I5,0,1,TRUE)))*2","v":2.7129539958870516E-12},{"$f":"IF(AND(B5>F5,B5<G5),\"Nej\",\"Ja\")","v":"Ja"},{"$f":"IF(AND(D5>0,K5=\"Ja\"),\"Ja\",\"Nej\")","v":"Nej"},{"$f":"IF(AND(D5<0,K5=\"Ja\"),\"Ja\",\"Nej\")","v":"Ja"},{"$f":"IF(F5>=2,\"Ja\",\"Nej\")","v":"Ja"},{"$f":"IF(G5<2,\"Ja\",\"Nej\")","v":"Nej"},null,null,{"$f":"+F5","v":18.899999999999999},{"$f":"+G5-F5","v":3.8000000000000007}]
["Venstre",13.3,9.1,-4.2000000000000011,{"$f":"NORMINV($B$29+(1-$B$29)/2,0,1)*(C6*(100-C6)/$B$26)^0.5","v":1.3308818716315294},{"$f":"ROUND(+C6-E6,1)","v":7.8},{"$f":"ROUND(+C6+E6,1)","v":10.4},{"$f":"\"[ \"&F6&\"; \"&G6&\" ]\"","v":"[ 7,8; 10,4 ]"},{"$f":"IF(C6/100=0,\"\",(C6/100-B6/100)/((C6/100*(1-C6/100)/$B$26))^0.5)","v":-6.185258744998003},{"$f":"(IF(I6>0,1-_xlfn.NORM.DIST(I6,0,1,TRUE),_xlfn.NORM.DIST(I6,0,1,TRUE)))*2","v":6.2000689262687366E-10},"Ja",{"$f":"IF(AND(D6>0,K6=\"Ja\"),\"Ja\",\"Nej\")","v":"Nej"},{"$f":"IF(AND(D6<0,K6=\"Ja\"),\"Ja\",\"Nej\")","v":"Ja"},{"$f":"IF(F6>=2,\"Ja\",\"Nej\")","v":"Ja"},{"$f":"IF(G6<2,\"Ja\",\"Nej\")","v":"Nej"},null,null,{"$f":"+F6","v":7.8},{"$f":"+G6-F6","v":2.6000000000000005}]
["Moderate",9.3000000000000007,9,-0.30000000000000071,1.3242769580496483,7.7,10.3,"[ 7,7; 10,3 ]",-0.44400772194057536,0.65703700103254659,"Nej",{"$f":"IF(AND(D7>0,K7=\"Ja\"),\"Ja\",\"Nej\")","v":"Nej"},"Nej","Ja","Nej",null,null,7.7,2.6000000000000005]
["SF",8.3000000000000007,13.1,4.7999999999999989,1.5612857925522901,11.5,14.7,"[ 11,5; 14,7 ]",6.0256918820819765,1.6838770378058143E-9,"Ja","Ja","Nej","Ja","Nej",null,null,11.5,3.1999999999999993]
["Danmarksdemokraterne",8.1,8.9,0.80000000000000071,1.3176226855124875,7.6,10.199999999999999,"[ 7,6; 10,2 ]",1.1900001456199762,0.23404633481160175,"Nej","Nej","Nej","Ja","Nej",null,null,7.6,2.5999999999999996]
["LA",7.9,11,3.0999999999999996,1.4478654925954195,9.6,12.4,"[ 9,6; 12,4 ]",4.1964453073487027,2.7113689884394887E-5,"Ja","Ja","Nej","Ja","Nej",null,null,9.6,2.8000000000000007]
["Konservative",5.5,5.5,0,1.0549554514245596,4.4000000000000004,6.6,"[ 4,4; 6,6 ]",0,1,"Nej","Nej","Nej","Ja","Nej",null,null,4.4000000000000004,2.1999999999999993]
["El",5.0999999999999996,7.6,2.5,1.2262517873858632,6.4,8.8000000000000007,"[ 6,4; 8,8 ]",3.9958432776647084,6.4464371533068388E-5,"Ja","Ja","Nej","Ja","Nej",null,null,6.4,2.4000000000000004]
["Radikale",3.8,3.3,-0.5,{"$f":"NORMINV($B$29+(1-$B$29)/2,0,1)*(C13*(100-C13)/$B$26)^0.5","v":0.82662222666348839},2.5,{"$f":"ROUND(+C13+E13,1)","v":4.0999999999999996},"[ 2,5; 4,1 ]",-1.1855258190014402,0.23580961250529436,"Nej","Nej","Nej","Ja","Nej",null,null,{"$f":"+F13","v":2.5},{"$f":"+G13-F13","v":1.5999999999999996}]
["Nye borgerlige",3.7,2.7,-1,0.75002402294657455,1.9,3.5,"[ 1,9; 3,5 ]",-2.6132016103165072,8.96983715826522E-3,"Ja","Nej","Ja","Nej","Nej",null,null,{"$f":"+F14","v":1.9},{"$f":"+G14-F14","v":1.6}]
["Alternativet",3.3,2.2000000000000002,-1.0999999999999996,0.67876218568510749,1.5,2.9,"[ 1,5; 2,9 ]",-3.1763118636580256,1.4916050454062957E-3,"Ja","Nej","Ja","Nej","Nej",null,null,1.5,1.4]
["DF",2.6,4.7,2.1,0.97933719890092896,3.7,5.7,"[ 3,7; 5,7 ]",4.2027652703821019,2.6367397126136893E-5,"Ja","Ja","Nej","Ja","Nej",null,null,3.7,2]
["Frie Grønne",0.9,0.6,-0.30000000000000004,0.35735979395203854,0.2,1,"[ 0,2; 1 ]",-1.6453703111350311,9.989346817196143E-2,"Nej","Nej","Nej","Nej","Ja",null,null,0.2,0.8]
[null,null,null,0,0,0,0,"[ 0; 0 ]","",{"$error":"#VALUE!"},"Ja","Nej","Nej","Nej","Ja",null,null,0,0]
[null,null,null,0,0,0,0,"[ 0; 0 ]","",{"$error":"#VALUE!"},"Ja","Nej","Nej","Nej","Ja",null,null,0,0]
[null,null,null,0,0,0,0,"[ 0; 0 ]","",{"$error":"#VALUE!"},"Ja","Nej","Nej","Nej","Ja",null,null,0,0]
[]
["Måling fra:"]
["Epinions måling den 31. marts 2023"]
[]
[]
["Stikprøvestørrelse",1794]
[]
[]
["Konfidensniveau",0.95]
[]
[]
["Parti - valgresultat - konfidensinterval"]
[{"$f":"+A5&\" \"&B5&\" \"&H5","v":"Socialdemokratiet 27,5 [ 18,9; 22,7 ]"}]
[{"$f":"+A6&\" \"&B6&\" \"&H6","v":"Venstre 13,3 [ 7,8; 10,4 ]"}]
["Moderate 9,3 [ 7,7; 10,3 ]"]
["SF 8,3 [ 11,5; 14,7 ]"]
["Danmarksdemokraterne 8,1 [ 7,6; 10,2 ]"]
["LA 7,9 [ 9,6; 12,4 ]"]
["Konservative 5,5 [ 4,4; 6,6 ]"]
["El 5,1 [ 6,4; 8,8 ]"]
["Radikale 3,8 [ 2,5; 4,1 ]"]
["Nye borgerlige 3,7 [ 1,9; 3,5 ]"]
["Alternativet 3,3 [ 1,5; 2,9 ]"]
["DF 2,6 [ 3,7; 5,7 ]"]
["Frie Grønne 0,9 [ 0,2; 1 ]"]
["  [ 0; 0 ]"]
["  [ 0; 0 ]"]
["  [ 0; 0 ]"]

{"sheet":"chi_help","index":11,"n_rows":1009,"n_cols":4,"rows_kept":1009,"cut":false,"hidden":true,"merged":[]}
[]
[]
["Start",0,"Kritisk værdi",{"$f":"ROUND(#REF!,3)","v":{"$error":"#REF!"}}]
["Interval",{"$f":"MAX(#REF!,#REF!)/800","v":{"$error":"#REF!"}},"Teststørrelse",{"$f":"ROUND(#REF!,3)","v":{"$error":"#REF!"}}]
[]
[]
[]
[null,"Chi2","Kritisk værdi","Teststørrelse"]
[{"$f":"+$B$3","v":0},{"$f":"_xlfn.CHISQ.DIST(A9,#REF!,FALSE)","v":{"$error":"#REF!"}},{"$f":"IF($A9<$D$3,IF($A10>$D$3,MAX($B$9:$B$1009),\"\"),\"\")","v":{"$error":"#REF!"}},{"$f":"IF($A9<$D$4,IF($A10>$D$4,MAX($B$9:$B$1009),\"\"),\"\")","v":{"$error":"#REF!"}}]
[{"$f":"+A9+$B$4","v":{"$error":"#REF!"}},{"$f":"_xlfn.CHISQ.DIST(A10,#REF!,FALSE)","v":{"$error":"#REF!"}},{"$error":"#REF!"},{"$error":"#REF!"}]
[{"$error":"#REF!"},{"$f":"_xlfn.CHISQ.DIST(A11,#REF!,FALSE)","v":{"$error":"#REF!"}},{"$error":"#REF!"},{"$error":"#REF!"}]
[{"$error":"#REF!"},{"$f":"_xlfn.CHISQ.DIST(A12,#REF!,FALSE)","v":{"$error":"#REF!"}},{"$error":"#REF!"},{"$error":"#REF!"}]
[{"$error":"#REF!"},{"$f":"_xlfn.CHISQ.DIST(A13,#REF!,FALSE)","v":{"$error":"#REF!"}},{"$error":"#REF!"},{"$error":"#REF!"}]
[{"$error":"#REF!"},{"$f":"_xlfn.CHISQ.DIST(A14,#REF!,FALSE)","v":{"$error":"#REF!"}},{"$error":"#REF!"},{"$error":"#REF!"}]
[{"$error":"#REF!"},{"$f":"_xlfn.CHISQ.DIST(A15,#REF!,FALSE)","v":{"$error":"#REF!"}},{"$error":"#REF!"},{"$error":"#REF!"}]
[{"$error":"#REF!"},{"$f":"_xlfn.CHISQ.DIST(A16,#REF!,FALSE)","v":{"$error":"#REF!"}},{"$error":"#REF!"},{"$error":"#REF!"}]
[{"$error":"#REF!"},{"$f":"_xlfn.CHISQ.DIST(A17,#REF!,FALSE)","v":{"$error":"#REF!"}},{"$error":"#REF!"},{"$error":"#REF!"}]
[{"$error":"#REF!"},{"$f":"_xlfn.CHISQ.DIST(A18,#REF!,FALSE)","v":{"$error":"#REF!"}},{"$error":"#REF!"},{"$error":"#REF!"}]
[{"$error":"#REF!"},{"$f":"_xlfn.CHISQ.DIST(A19,#REF!,FALSE)","v":{"$error":"#REF!"}},{"$error":"#REF!"},{"$error":"#REF!"}]
[{"$error":"#REF!"},{"$f":"_xlfn.CHISQ.DIST(A20,#REF!,FALSE)","v":{"$error":"#REF!"}},{"$error":"#REF!"},{"$error":"#REF!"}]
[{"$error":"#REF!"},{"$f":"_xlfn.CHISQ.DIST(A21,#REF!,FALSE)","v":{"$error":"#REF!"}},{"$error":"#REF!"},{"$error":"#REF!"}]
[{"$error":"#REF!"},{"$f":"_xlfn.CHISQ.DIST(A22,#REF!,FALSE)","v":{"$error":"#REF!"}},{"$error":"#REF!"},{"$error":"#REF!"}]
[{"$error":"#REF!"},{"$f":"_xlfn.CHISQ.DIST(A23,#REF!,FALSE)","v":{"$error":"#REF!"}},{"$error":"#REF!"},{"$error":"#REF!"}]
[{"$error":"#REF!"},{"$f":"_xlfn.CHISQ.DIST(A24,#REF!,FALSE)","v":{"$error":"#REF!"}},{"$error":"#REF!"},{"$error":"#REF!"}]
[{"$error":"#REF!"},{"$f":"_xlfn.CHISQ.DIST(A25,#REF!,FALSE)","v":{"$error":"#REF!"}},{"$error":"#REF!"},{"$error":"#REF!"}]
[{"$error":"#REF!"},{"$f":"_xlfn.CHISQ.DIST(A26,#REF!,FALSE)","v":{"$error":"#REF!"}},{"$error":"#REF!"},{"$error":"#REF!"}]
[{"$error":"#REF!"},{"$f":"_xlfn.CHISQ.DIST(A27,#REF!,FALSE)","v":{"$error":"#REF!"}},{"$error":"#REF!"},{"$error":"#REF!"}]
[{"$error":"#REF!"},{"$f":"_xlfn.CHISQ.DIST(A28,#REF!,FALSE)","v":{"$error":"#REF!"}},{"$error":"#REF!"},{"$error":"#REF!"}]
[{"$error":"#REF!"},{"$f":"_xlfn.CHISQ.DIST(A29,#REF!,FALSE)","v":{"$error":"#REF!"}},{"$error":"#REF!"},{"$error":"#REF!"}]
[{"$error":"#REF!"},{"$f":"_xlfn.CHISQ.DIST(A30,#REF!,FALSE)","v":{"$error":"#REF!"}},{"$error":"#REF!"},{"$error":"#REF!"}]
[{"$error":"#REF!"},{"$f":"_xlfn.CHISQ.DIST(A31,#REF!,FALSE)","v":{"$error":"#REF!"}},{"$error":"#REF!"},{"$error":"#REF!"}]
[{"$error":"#REF!"},{"$f":"_xlfn.CHISQ.DIST(A32,#REF!,FALSE)","v":{"$error":"#REF!"}},{"$error":"#REF!"},{"$error":"#REF!"}]
[{"$error":"#REF!"},{"$f":"_xlfn.CHISQ.DIST(A33,#REF!,FALSE)","v":{"$error":"#REF!"}},{"$error":"#REF!"},{"$error":"#REF!"}]
[{"$error":"#REF!"},{"$f":"_xlfn.CHISQ.DIST(A34,#REF!,FALSE)","v":{"$error":"#REF!"}},{"$error":"#REF!"},{"$error":"#REF!"}]
[{"$error":"#REF!"},{"$f":"_xlfn.CHISQ.DIST(A35,#REF!,FALSE)","v":{"$error":"#REF!"}},{"$error":"#REF!"},{"$error":"#REF!"}]
[{"$error":"#REF!"},{"$f":"_xlfn.CHISQ.DIST(A36,#REF!,FALSE)","v":{"$error":"#REF!"}},{"$error":"#REF!"},{"$error":"#REF!"}]
[{"$error":"#REF!"},{"$f":"_xlfn.CHISQ.DIST(A37,#REF!,FALSE)","v":{"$error":"#REF!"}},{"$error":"#REF!"},{"$error":"#REF!"}]
[{"$error":"#REF!"},{"$f":"_xlfn.CHISQ.DIST(A38,#REF!,FALSE)","v":{"$error":"#REF!"}},{"$error":"#REF!"},{"$error":"#REF!"}]
[{"$error":"#REF!"},{"$f":"_xlfn.CHISQ.DIST(A39,#REF!,FALSE)","v":{"$error":"#REF!"}},{"$error":"#REF!"},{"$error":"#REF!"}]
[{"$error":"#REF!"},{"$f":"_xlfn.CHISQ.DIST(A40,#REF!,FALSE)","v":{"$error":"#REF!"}},{"$error":"#REF!"},{"$error":"#REF!"}]
[{"$error":"#REF!"},{"$f":"_xlfn.CHISQ.DIST(A41,#REF!,FALSE)","v":{"$error":"#REF!"}},{"$error":"#REF!"},{"$error":"#REF!"}]
[{"$error":"#REF!"},{"$f":"_xlfn.CHISQ.DIST(A42,#REF!,FALSE)","v":{"$error":"#REF!"}},{"$error":"#REF!"},{"$error":"#REF!"}]
[{"$error":"#REF!"},{"$f":"_xlfn.CHISQ.DIST(A43,#REF!,FALSE)","v":{"$error":"#REF!"}},{"$error":"#REF!"},{"$error":"#REF!"}]
[{"$error":"#REF!"},{"$f":"_xlfn.CHISQ.DIST(A44,#REF!,FALSE)","v":{"$error":"#REF!"}},{"$error":"#REF!"},{"$error":"#REF!"}]
[{"$error":"#REF!"},{"$f":"_xlfn.CHISQ.DIST(A45,#REF!,FALSE)","v":{"$error":"#REF!"}},{"$error":"#REF!"},{"$error":"#REF!"}]
[{"$error":"#REF!"},{"$f":"_xlfn.CHISQ.DIST(A46,#REF!,FALSE)","v":{"$error":"#REF!"}},{"$error":"#REF!"},{"$error":"#REF!"}]
[{"$error":"#REF!"},{"$f":"_xlfn.CHISQ.DIST(A47,#REF!,FALSE)","v":{"$error":"#REF!"}},{"$error":"#REF!"},{"$error":"#REF!"}]
[{"$error":"#REF!"},{"$f":"_xlfn.CHISQ.DIST(A48,#REF!,FALSE)","v":{"$error":"#REF!"}},{"$error":"#REF!"},{"$error":"#REF!"}]
[{"$error":"#REF!"},{"$f":"_xlfn.CHISQ.DIST(A49,#REF!,FALSE)","v":{"$error":"#REF!"}},{"$error":"#REF!"},{"$error":"#REF!"}]
[{"$error":"#REF!"},{"$f":"_xlfn.CHISQ.DIST(A50,#REF!,FALSE)","v":{"$error":"#REF!"}},{"$error":"#REF!"},{"$error":"#REF!"}]
[{"$error":"#REF!"},{"$f":"_xlfn.CHISQ.DIST(A51,#REF!,FALSE)","v":{"$error":"#REF!"}},{"$error":"#REF!"},{"$error":"#REF!"}]
[{"$error":"#REF!"},{"$f":"_xlfn.CHISQ.DIST(A52,#REF!,FALSE)","v":{"$error":"#REF!"}},{"$error":"#REF!"},{"$error":"#REF!"}]
[{"$error":"#REF!"},{"$f":"_xlfn.CHISQ.DIST(A53,#REF!,FALSE)","v":{"$error":"#REF!"}},{"$error":"#REF!"},{"$error":"#REF!"}]
[{"$error":"#REF!"},{"$f":"_xlfn.CHISQ.DIST(A54,#REF!,FALSE)","v":{"$error":"#REF!"}},{"$error":"#REF!"},{"$error":"#REF!"}]
[{"$error":"#REF!"},{"$f":"_xlfn.CHISQ.DIST(A55,#REF!,FALSE)","v":{"$error":"#REF!"}},{"$error":"#REF!"},{"$error":"#REF!"}]
[{"$error":"#REF!"},{"$f":"_xlfn.CHISQ.DIST(A56,#REF!,FALSE)","v":{"$error":"#REF!"}},{"$error":"#REF!"},{"$error":"#REF!"}]
[{"$error":"#REF!"},{"$f":"_xlfn.CHISQ.DIST(A57,#REF!,FALSE)","v":{"$error":"#REF!"}},{"$error":"#REF!"},{"$error":"#REF!"}]
[{"$error":"#REF!"},{"$f":"_xlfn.CHISQ.DIST(A58,#REF!,FALSE)","v":{"$error":"#REF!"}},{"$error":"#REF!"},{"$error":"#REF!"}]
[{"$error":"#REF!"},{"$f":"_xlfn.CHISQ.DIST(A59,#REF!,FALSE)","v":{"$error":"#REF!"}},{"$error":"#REF!"},{"$error":"#REF!"}]
[{"$error":"#REF!"},{"$f":"_xlfn.CHISQ.DIST(A60,#REF!,FALSE)","v":{"$error":"#REF!"}},{"$error":"#REF!"},{"$error":"#REF!"}]
[{"$error":"#REF!"},{"$f":"_xlfn.CHISQ.DIST(A61,#REF!,FALSE)","v":{"$error":"#REF!"}},{"$error":"#REF!"},{"$error":"#REF!"}]
[{"$error":"#REF!"},{"$f":"_xlfn.CHISQ.DIST(A62,#REF!,FALSE)","v":{"$error":"#REF!"}},{"$error":"#REF!"},{"$error":"#REF!"}]
[{"$error":"#REF!"},{"$f":"_xlfn.CHISQ.DIST(A63,#REF!,FALSE)","v":{"$error":"#REF!"}},{"$error":"#REF!"},{"$error":"#REF!"}]
[{"$error":"#REF!"},{"$f":"_xlfn.CHISQ.DIST(A64,#REF!,FALSE)","v":{"$error":"#REF!"}},{"$error":"#REF!"},{"$error":"#REF!"}]
[{"$error":"#REF!"},{"$f":"_xlfn.CHISQ.DIST(A65,#REF!,FALSE)","v":{"$error":"#REF!"}},{"$error":"#REF!"},{"$error":"#REF!"}]
[{"$error":"#REF!"},{"$f":"_xlfn.CHISQ.DIST(A66,#REF!,FALSE)","v":{"$error":"#REF!"}},{"$error":"#REF!"},{"$error":"#REF!"}]
[{"$error":"#REF!"},{"$f":"_xlfn.CHISQ.DIST(A67,#REF!,FALSE)","v":{"$error":"#REF!"}},{"$error":"#REF!"},{"$error":"#REF!"}]
[{"$error":"#REF!"},{"$f":"_xlfn.CHISQ.DIST(A68,#REF!,FALSE)","v":{"$error":"#REF!"}},{"$error":"#REF!"},{"$error":"#REF!"}]
[{"$error":"#REF!"},{"$f":"_xlfn.CHISQ.DIST(A69,#REF!,FALSE)","v":{"$error":"#REF!"}},{"$error":"#REF!"},{"$error":"#REF!"}]
[{"$error":"#REF!"},{"$f":"_xlfn.CHISQ.DIST(A70,#REF!,FALSE)","v":{"$error":"#REF!"}},{"$error":"#REF!"},{"$error":"#REF!"}]
[{"$error":"#REF!"},{"$f":"_xlfn.CHISQ.DIST(A71,#REF!,FALSE)","v":{"$error":"#REF!"}},{"$error":"#REF!"},{"$error":"#REF!"}]
[{"$error":"#REF!"},{"$f":"_xlfn.CHISQ.DIST(A72,#REF!,FALSE)","v":{"$error":"#REF!"}},{"$error":"#REF!"},{"$error":"#REF!"}]
[{"$error":"#REF!"},{"$f":"_xlfn.CHISQ.DIST(A73,#REF!,FALSE)","v":{"$error":"#REF!"}},{"$f":"IF($A73<$D$3,IF($A74>$D$3,MAX($B$9:$B$1009),\"\"),\"\")","v":{"$error":"#REF!"}},{"$f":"IF($A73<$D$4,IF($A74>$D$4,MAX($B$9:$B$1009),\"\"),\"\")","v":{"$error":"#REF!"}}]
[{"$f":"+A73+$B$4","v":{"$error":"#REF!"}},{"$f":"_xlfn.CHISQ.DIST(A74,#REF!,FALSE)","v":{"$error":"#REF!"}},{"$error":"#REF!"},{"$error":"#REF!"}]
[{"$error":"#REF!"},{"$f":"_xlfn.CHISQ.DIST(A75,#REF!,FALSE)","v":{"$error":"#REF!"}},{"$error":"#REF!"},{"$error":"#REF!"}]
[{"$error":"#REF!"},{"$f":"_xlfn.CHISQ.DIST(A76,#REF!,FALSE)","v":{"$error":"#REF!"}},{"$error":"#REF!"},{"$error":"#REF!"}]
[{"$error":"#REF!"},{"$f":"_xlfn.CHISQ.DIST(A77,#REF!,FALSE)","v":{"$error":"#REF!"}},{"$error":"#REF!"},{"$error":"#REF!"}]
[{"$error":"#REF!"},{"$f":"_xlfn.CHISQ.DIST(A78,#REF!,FALSE)","v":{"$error":"#REF!"}},{"$error":"#REF!"},{"$error":"#REF!"}]
[{"$error":"#REF!"},{"$f":"_xlfn.CHISQ.DIST(A79,#REF!,FALSE)","v":{"$error":"#REF!"}},{"$error":"#REF!"},{"$error":"#REF!"}]
[{"$error":"#REF!"},{"$f":"_xlfn.CHISQ.DIST(A80,#REF!,FALSE)","v":{"$error":"#REF!"}},{"$error":"#REF!"},{"$error":"#REF!"}]
[{"$error":"#REF!"},{"$f":"_xlfn.CHISQ.DIST(A81,#REF!,FALSE)","v":{"$error":"#REF!"}},{"$error":"#REF!"},{"$error":"#REF!"}]
[{"$error":"#REF!"},{"$f":"_xlfn.CHISQ.DIST(A82,#REF!,FALSE)","v":{"$error":"#REF!"}},{"$error":"#REF!"},{"$error":"#REF!"}]
[{"$error":"#REF!"},{"$f":"_xlfn.CHISQ.DIST(A83,#REF!,FALSE)","v":{"$error":"#REF!"}},{"$error":"#REF!"},{"$error":"#REF!"}]
[{"$error":"#REF!"},{"$f":"_xlfn.CHISQ.DIST(A84,#REF!,FALSE)","v":{"$error":"#REF!"}},{"$error":"#REF!"},{"$error":"#REF!"}]
[{"$error":"#REF!"},{"$f":"_xlfn.CHISQ.DIST(A85,#REF!,FALSE)","v":{"$error":"#REF!"}},{"$error":"#REF!"},{"$error":"#REF!"}]
[{"$error":"#REF!"},{"$f":"_xlfn.CHISQ.DIST(A86,#REF!,FALSE)","v":{"$error":"#REF!"}},{"$error":"#REF!"},{"$error":"#REF!"}]
[{"$error":"#REF!"},{"$f":"_xlfn.CHISQ.DIST(A87,#REF!,FALSE)","v":{"$error":"#REF!"}},{"$error":"#REF!"},{"$error":"#REF!"}]
[{"$error":"#REF!"},{"$f":"_xlfn.CHISQ.DIST(A88,#REF!,FALSE)","v":{"$error":"#REF!"}},{"$error":"#REF!"},{"$error":"#REF!"}]
[{"$error":"#REF!"},{"$f":"_xlfn.CHISQ.DIST(A89,#REF!,FALSE)","v":{"$error":"#REF!"}},{"$error":"#REF!"},{"$error":"#REF!"}]
[{"$error":"#REF!"},{"$f":"_xlfn.CHISQ.DIST(A90,#REF!,FALSE)","v":{"$error":"#REF!"}},{"$error":"#REF!"},{"$error":"#REF!"}]
[{"$error":"#REF!"},{"$f":"_xlfn.CHISQ.DIST(A91,#REF!,FALSE)","v":{"$error":"#REF!"}},{"$error":"#REF!"},{"$error":"#REF!"}]
[{"$error":"#REF!"},{"$f":"_xlfn.CHISQ.DIST(A92,#REF!,FALSE)","v":{"$error":"#REF!"}},{"$error":"#REF!"},{"$error":"#REF!"}]
[{"$error":"#REF!"},{"$f":"_xlfn.CHISQ.DIST(A93,#REF!,FALSE)","v":{"$error":"#REF!"}},{"$error":"#REF!"},{"$error":"#REF!"}]
[{"$error":"#REF!"},{"$f":"_xlfn.CHISQ.DIST(A94,#REF!,FALSE)","v":{"$error":"#REF!"}},{"$error":"#REF!"},{"$error":"#REF!"}]
[{"$error":"#REF!"},{"$f":"_xlfn.CHISQ.DIST(A95,#REF!,FALSE)","v":{"$error":"#REF!"}},{"$error":"#REF!"},{"$error":"#REF!"}]
[{"$error":"#REF!"},{"$f":"_xlfn.CHISQ.DIST(A96,#REF!,FALSE)","v":{"$error":"#REF!"}},{"$error":"#REF!"},{"$error":"#REF!"}]
[{"$error":"#REF!"},{"$f":"_xlfn.CHISQ.DIST(A97,#REF!,FALSE)","v":{"$error":"#REF!"}},{"$error":"#REF!"},{"$error":"#REF!"}]
[{"$error":"#REF!"},{"$f":"_xlfn.CHISQ.DIST(A98,#REF!,FALSE)","v":{"$error":"#REF!"}},{"$error":"#REF!"},{"$error":"#REF!"}]
[{"$error":"#REF!"},{"$f":"_xlfn.CHISQ.DIST(A99,#REF!,FALSE)","v":{"$error":"#REF!"}},{"$error":"#REF!"},{"$error":"#REF!"}]
[{"$error":"#REF!"},{"$f":"_xlfn.CHISQ.DIST(A100,#REF!,FALSE)","v":{"$error":"#REF!"}},{"$error":"#REF!"},{"$error":"#REF!"}]
[{"$error":"#REF!"},{"$f":"_xlfn.CHISQ.DIST(A101,#REF!,FALSE)","v":{"$error":"#REF!"}},{"$error":"#REF!"},{"$error":"#REF!"}]
[{"$error":"#REF!"},{"$f":"_xlfn.CHISQ.DIST(A102,#REF!,FALSE)","v":{"$error":"#REF!"}},{"$error":"#REF!"},{"$error":"#REF!"}]
[{"$error":"#REF!"},{"$f":"_xlfn.CHISQ.DIST(A103,#REF!,FALSE)","v":{"$error":"#REF!"}},{"$error":"#REF!"},{"$error":"#REF!"}]
[{"$error":"#REF!"},{"$f":"_xlfn.CHISQ.DIST(A104,#REF!,FALSE)","v":{"$error":"#REF!"}},{"$error":"#REF!"},{"$error":"#REF!"}]
[{"$error":"#REF!"},{"$f":"_xlfn.CHISQ.DIST(A105,#REF!,FALSE)","v":{"$error":"#REF!"}},{"$error":"#REF!"},{"$error":"#REF!"}]
[{"$error":"#REF!"},{"$f":"_xlfn.CHISQ.DIST(A106,#REF!,FALSE)","v":{"$error":"#REF!"}},{"$error":"#REF!"},{"$error":"#REF!"}]
[{"$error":"#REF!"},{"$f":"_xlfn.CHISQ.DIST(A107,#REF!,FALSE)","v":{"$error":"#REF!"}},{"$error":"#REF!"},{"$error":"#REF!"}]
[{"$error":"#REF!"},{"$f":"_xlfn.CHISQ.DIST(A108,#REF!,FALSE)","v":{"$error":"#REF!"}},{"$error":"#REF!"},{"$error":"#REF!"}]
[{"$error":"#REF!"},{"$f":"_xlfn.CHISQ.DIST(A109,#REF!,FALSE)","v":{"$error":"#REF!"}},{"$error":"#REF!"},{"$error":"#REF!"}]
[{"$error":"#REF!"},{"$f":"_xlfn.CHISQ.DIST(A110,#REF!,FALSE)","v":{"$error":"#REF!"}},{"$error":"#REF!"},{"$error":"#REF!"}]
[{"$error":"#REF!"},{"$f":"_xlfn.CHISQ.DIST(A111,#REF!,FALSE)","v":{"$error":"#REF!"}},{"$error":"#REF!"},{"$error":"#REF!"}]
[{"$error":"#REF!"},{"$f":"_xlfn.CHISQ.DIST(A112,#REF!,FALSE)","v":{"$error":"#REF!"}},{"$error":"#REF!"},{"$error":"#REF!"}]
[{"$error":"#REF!"},{"$f":"_xlfn.CHISQ.DIST(A113,#REF!,FALSE)","v":{"$error":"#REF!"}},{"$error":"#REF!"},{"$error":"#REF!"}]
[{"$error":"#REF!"},{"$f":"_xlfn.CHISQ.DIST(A114,#REF!,FALSE)","v":{"$error":"#REF!"}},{"$error":"#REF!"},{"$error":"#REF!"}]
[{"$error":"#REF!"},{"$f":"_xlfn.CHISQ.DIST(A115,#REF!,FALSE)","v":{"$error":"#REF!"}},{"$error":"#REF!"},{"$error":"#REF!"}]
[{"$error":"#REF!"},{"$f":"_xlfn.CHISQ.DIST(A116,#REF!,FALSE)","v":{"$error":"#REF!"}},{"$error":"#REF!"},{"$error":"#REF!"}]
[{"$error":"#REF!"},{"$f":"_xlfn.CHISQ.DIST(A117,#REF!,FALSE)","v":{"$error":"#REF!"}},{"$error":"#REF!"},{"$error":"#REF!"}]
[{"$error":"#REF!"},{"$f":"_xlfn.CHISQ.DIST(A118,#REF!,FALSE)","v":{"$error":"#REF!"}},{"$error":"#REF!"},{"$error":"#REF!"}]
[{"$error":"#REF!"},{"$f":"_xlfn.CHISQ.DIST(A119,#REF!,FALSE)","v":{"$error":"#REF!"}},{"$error":"#REF!"},{"$error":"#REF!"}]
[{"$error":"#REF!"},{"$f":"_xlfn.CHISQ.DIST(A120,#REF!,FALSE)","v":{"$error":"#REF!"}},{"$error":"#REF!"},{"$error":"#REF!"}]
[{"$error":"#REF!"},{"$f":"_xlfn.CHISQ.DIST(A121,#REF!,FALSE)","v":{"$error":"#REF!"}},{"$error":"#REF!"},{"$error":"#REF!"}]
[{"$error":"#REF!"},{"$f":"_xlfn.CHISQ.DIST(A122,#REF!,FALSE)","v":{"$error":"#REF!"}},{"$error":"#REF!"},{"$error":"#REF!"}]
[{"$error":"#REF!"},{"$f":"_xlfn.CHISQ.DIST(A123,#REF!,FALSE)","v":{"$error":"#REF!"}},{"$error":"#REF!"},{"$error":"#REF!"}]
[{"$error":"#REF!"},{"$f":"_xlfn.CHISQ.DIST(A124,#REF!,FALSE)","v":{"$error":"#REF!"}},{"$error":"#REF!"},{"$error":"#REF!"}]
[{"$error":"#REF!"},{"$f":"_xlfn.CHISQ.DIST(A125,#REF!,FALSE)","v":{"$error":"#REF!"}},{"$error":"#REF!"},{"$error":"#REF!"}]
[{"$error":"#REF!"},{"$f":"_xlfn.CHISQ.DIST(A126,#REF!,FALSE)","v":{"$error":"#REF!"}},{"$error":"#REF!"},{"$error":"#REF!"}]
[{"$error":"#REF!"},{"$f":"_xlfn.CHISQ.DIST(A127,#REF!,FALSE)","v":{"$error":"#REF!"}},{"$error":"#REF!"},{"$error":"#REF!"}]
[{"$error":"#REF!"},{"$f":"_xlfn.CHISQ.DIST(A128,#REF!,FALSE)","v":{"$error":"#REF!"}},{"$error":"#REF!"},{"$error":"#REF!"}]
[{"$error":"#REF!"},{"$f":"_xlfn.CHISQ.DIST(A129,#REF!,FALSE)","v":{"$error":"#REF!"}},{"$error":"#REF!"},{"$error":"#REF!"}]
[{"$error":"#REF!"},{"$f":"_xlfn.CHISQ.DIST(A130,#REF!,FALSE)","v":{"$error":"#REF!"}},{"$error":"#REF!"},{"$error":"#REF!"}]
[{"$error":"#REF!"},{"$f":"_xlfn.CHISQ.DIST(A131,#REF!,FALSE)","v":{"$error":"#REF!"}},{"$error":"#REF!"},{"$error":"#REF!"}]
[{"$error":"#REF!"},{"$f":"_xlfn.CHISQ.DIST(A132,#REF!,FALSE)","v":{"$error":"#REF!"}},{"$error":"#REF!"},{"$error":"#REF!"}]
[{"$error":"#REF!"},{"$f":"_xlfn.CHISQ.DIST(A133,#REF!,FALSE)","v":{"$error":"#REF!"}},{"$error":"#REF!"},{"$error":"#REF!"}]
[{"$error":"#REF!"},{"$f":"_xlfn.CHISQ.DIST(A134,#REF!,FALSE)","v":{"$error":"#REF!"}},{"$error":"#REF!"},{"$error":"#REF!"}]
[{"$error":"#REF!"},{"$f":"_xlfn.CHISQ.DIST(A135,#REF!,FALSE)","v":{"$error":"#REF!"}},{"$error":"#REF!"},{"$error":"#REF!"}]
[{"$error":"#REF!"},{"$f":"_xlfn.CHISQ.DIST(A136,#REF!,FALSE)","v":{"$error":"#REF!"}},{"$error":"#REF!"},{"$error":"#REF!"}]
[{"$error":"#REF!"},{"$f":"_xlfn.CHISQ.DIST(A137,#REF!,FALSE)","v":{"$error":"#REF!"}},{"$f":"IF($A137<$D$3,IF($A138>$D$3,MAX($B$9:$B$1009),\"\"),\"\")","v":{"$error":"#REF!"}},{"$f":"IF($A137<$D$4,IF($A138>$D$4,MAX($B$9:$B$1009),\"\"),\"\")","v":{"$error":"#REF!"}}]
[{"$f":"+A137+$B$4","v":{"$error":"#REF!"}},{"$f":"_xlfn.CHISQ.DIST(A138,#REF!,FALSE)","v":{"$error":"#REF!"}},{"$error":"#REF!"},{"$error":"#REF!"}]
[{"$error":"#REF!"},{"$f":"_xlfn.CHISQ.DIST(A139,#REF!,FALSE)","v":{"$error":"#REF!"}},{"$error":"#REF!"},{"$error":"#REF!"}]
[{"$error":"#REF!"},{"$f":"_xlfn.CHISQ.DIST(A140,#REF!,FALSE)","v":{"$error":"#REF!"}},{"$error":"#REF!"},{"$error":"#REF!"}]
[{"$error":"#REF!"},{"$f":"_xlfn.CHISQ.DIST(A141,#REF!,FALSE)","v":{"$error":"#REF!"}},{"$error":"#REF!"},{"$error":"#REF!"}]
[{"$error":"#REF!"},{"$f":"_xlfn.CHISQ.DIST(A142,#REF!,FALSE)","v":{"$error":"#REF!"}},{"$error":"#REF!"},{"$error":"#REF!"}]
[{"$error":"#REF!"},{"$f":"_xlfn.CHISQ.DIST(A143,#REF!,FALSE)","v":{"$error":"#REF!"}},{"$error":"#REF!"},{"$error":"#REF!"}]
[{"$error":"#REF!"},{"$f":"_xlfn.CHISQ.DIST(A144,#REF!,FALSE)","v":{"$error":"#REF!"}},{"$error":"#REF!"},{"$error":"#REF!"}]
[{"$error":"#REF!"},{"$f":"_xlfn.CHISQ.DIST(A145,#REF!,FALSE)","v":{"$error":"#REF!"}},{"$error":"#REF!"},{"$error":"#REF!"}]
[{"$error":"#REF!"},{"$f":"_xlfn.CHISQ.DIST(A146,#REF!,FALSE)","v":{"$error":"#REF!"}},{"$error":"#REF!"},{"$error":"#REF!"}]
[{"$error":"#REF!"},{"$f":"_xlfn.CHISQ.DIST(A147,#REF!,FALSE)","v":{"$error":"#REF!"}},{"$error":"#REF!"},{"$error":"#REF!"}]
[{"$error":"#REF!"},{"$f":"_xlfn.CHISQ.DIST(A148,#REF!,FALSE)","v":{"$error":"#REF!"}},{"$error":"#REF!"},{"$error":"#REF!"}]
[{"$error":"#REF!"},{"$f":"_xlfn.CHISQ.DIST(A149,#REF!,FALSE)","v":{"$error":"#REF!"}},{"$error":"#REF!"},{"$error":"#REF!"}]
[{"$error":"#REF!"},{"$f":"_xlfn.CHISQ.DIST(A150,#REF!,FALSE)","v":{"$error":"#REF!"}},{"$error":"#REF!"},{"$error":"#REF!"}]
[{"$error":"#REF!"},{"$f":"_xlfn.CHISQ.DIST(A151,#REF!,FALSE)","v":{"$error":"#REF!"}},{"$error":"#REF!"},{"$error":"#REF!"}]
[{"$error":"#REF!"},{"$f":"_xlfn.CHISQ.DIST(A152,#REF!,FALSE)","v":{"$error":"#REF!"}},{"$error":"#REF!"},{"$error":"#REF!"}]
[{"$error":"#REF!"},{"$f":"_xlfn.CHISQ.DIST(A153,#REF!,FALSE)","v":{"$error":"#REF!"}},{"$error":"#REF!"},{"$error":"#REF!"}]
[{"$error":"#REF!"},{"$f":"_xlfn.CHISQ.DIST(A154,#REF!,FALSE)","v":{"$error":"#REF!"}},{"$error":"#REF!"},{"$error":"#REF!"}]
[{"$error":"#REF!"},{"$f":"_xlfn.CHISQ.DIST(A155,#REF!,FALSE)","v":{"$error":"#REF!"}},{"$error":"#REF!"},{"$error":"#REF!"}]
[{"$error":"#REF!"},{"$f":"_xlfn.CHISQ.DIST(A156,#REF!,FALSE)","v":{"$error":"#REF!"}},{"$error":"#REF!"},{"$error":"#REF!"}]
[{"$error":"#REF!"},{"$f":"_xlfn.CHISQ.DIST(A157,#REF!,FALSE)","v":{"$error":"#REF!"}},{"$error":"#REF!"},{"$error":"#REF!"}]
[{"$error":"#REF!"},{"$f":"_xlfn.CHISQ.DIST(A158,#REF!,FALSE)","v":{"$error":"#REF!"}},{"$error":"#REF!"},{"$error":"#REF!"}]
[{"$error":"#REF!"},{"$f":"_xlfn.CHISQ.DIST(A159,#REF!,FALSE)","v":{"$error":"#REF!"}},{"$error":"#REF!"},{"$error":"#REF!"}]
[{"$error":"#REF!"},{"$f":"_xlfn.CHISQ.DIST(A160,#REF!,FALSE)","v":{"$error":"#REF!"}},{"$error":"#REF!"},{"$error":"#REF!"}]
[{"$error":"#REF!"},{"$f":"_xlfn.CHISQ.DIST(A161,#REF!,FALSE)","v":{"$error":"#REF!"}},{"$error":"#REF!"},{"$error":"#REF!"}]
[{"$error":"#REF!"},{"$f":"_xlfn.CHISQ.DIST(A162,#REF!,FALSE)","v":{"$error":"#REF!"}},{"$error":"#REF!"},{"$error":"#REF!"}]
[{"$error":"#REF!"},{"$f":"_xlfn.CHISQ.DIST(A163,#REF!,FALSE)","v":{"$error":"#REF!"}},{"$error":"#REF!"},{"$error":"#REF!"}]
[{"$error":"#REF!"},{"$f":"_xlfn.CHISQ.DIST(A164,#REF!,FALSE)","v":{"$error":"#REF!"}},{"$error":"#REF!"},{"$error":"#REF!"}]
[{"$error":"#REF!"},{"$f":"_xlfn.CHISQ.DIST(A165,#REF!,FALSE)","v":{"$error":"#REF!"}},{"$error":"#REF!"},{"$error":"#REF!"}]
[{"$error":"#REF!"},{"$f":"_xlfn.CHISQ.DIST(A166,#REF!,FALSE)","v":{"$error":"#REF!"}},{"$error":"#REF!"},{"$error":"#REF!"}]
[{"$error":"#REF!"},{"$f":"_xlfn.CHISQ.DIST(A167,#REF!,FALSE)","v":{"$error":"#REF!"}},{"$error":"#REF!"},{"$error":"#REF!"}]
[{"$error":"#REF!"},{"$f":"_xlfn.CHISQ.DIST(A168,#REF!,FALSE)","v":{"$error":"#REF!"}},{"$error":"#REF!"},{"$error":"#REF!"}]
[{"$error":"#REF!"},{"$f":"_xlfn.CHISQ.DIST(A169,#REF!,FALSE)","v":{"$error":"#REF!"}},{"$error":"#REF!"},{"$error":"#REF!"}]
[{"$error":"#REF!"},{"$f":"_xlfn.CHISQ.DIST(A170,#REF!,FALSE)","v":{"$error":"#REF!"}},{"$error":"#REF!"},{"$error":"#REF!"}]
[{"$error":"#REF!"},{"$f":"_xlfn.CHISQ.DIST(A171,#REF!,FALSE)","v":{"$error":"#REF!"}},{"$error":"#REF!"},{"$error":"#REF!"}]
[{"$error":"#REF!"},{"$f":"_xlfn.CHISQ.DIST(A172,#REF!,FALSE)","v":{"$error":"#REF!"}},{"$error":"#REF!"},{"$error":"#REF!"}]
[{"$error":"#REF!"},{"$f":"_xlfn.CHISQ.DIST(A173,#REF!,FALSE)","v":{"$error":"#REF!"}},{"$error":"#REF!"},{"$error":"#REF!"}]
[{"$error":"#REF!"},{"$f":"_xlfn.CHISQ.DIST(A174,#REF!,FALSE)","v":{"$error":"#REF!"}},{"$error":"#REF!"},{"$error":"#REF!"}]
[{"$error":"#REF!"},{"$f":"_xlfn.CHISQ.DIST(A175,#REF!,FALSE)","v":{"$error":"#REF!"}},{"$error":"#REF!"},{"$error":"#REF!"}]
[{"$error":"#REF!"},{"$f":"_xlfn.CHISQ.DIST(A176,#REF!,FALSE)","v":{"$error":"#REF!"}},{"$error":"#REF!"},{"$error":"#REF!"}]
[{"$error":"#REF!"},{"$f":"_xlfn.CHISQ.DIST(A177,#REF!,FALSE)","v":{"$error":"#REF!"}},{"$error":"#REF!"},{"$error":"#REF!"}]
[{"$error":"#REF!"},{"$f":"_xlfn.CHISQ.DIST(A178,#REF!,FALSE)","v":{"$error":"#REF!"}},{"$error":"#REF!"},{"$error":"#REF!"}]
[{"$error":"#REF!"},{"$f":"_xlfn.CHISQ.DIST(A179,#REF!,FALSE)","v":{"$error":"#REF!"}},{"$error":"#REF!"},{"$error":"#REF!"}]
[{"$error":"#REF!"},{"$f":"_xlfn.CHISQ.DIST(A180,#REF!,FALSE)","v":{"$error":"#REF!"}},{"$error":"#REF!"},{"$error":"#REF!"}]
[{"$error":"#REF!"},{"$f":"_xlfn.CHISQ.DIST(A181,#REF!,FALSE)","v":{"$error":"#REF!"}},{"$error":"#REF!"},{"$error":"#REF!"}]
[{"$error":"#REF!"},{"$f":"_xlfn.CHISQ.DIST(A182,#REF!,FALSE)","v":{"$error":"#REF!"}},{"$error":"#REF!"},{"$error":"#REF!"}]
[{"$error":"#REF!"},{"$f":"_xlfn.CHISQ.DIST(A183,#REF!,FALSE)","v":{"$error":"#REF!"}},{"$error":"#REF!"},{"$error":"#REF!"}]
[{"$error":"#REF!"},{"$f":"_xlfn.CHISQ.DIST(A184,#REF!,FALSE)","v":{"$error":"#REF!"}},{"$error":"#REF!"},{"$error":"#REF!"}]
[{"$error":"#REF!"},{"$f":"_xlfn.CHISQ.DIST(A185,#REF!,FALSE)","v":{"$error":"#REF!"}},{"$error":"#REF!"},{"$error":"#REF!"}]
[{"$error":"#REF!"},{"$f":"_xlfn.CHISQ.DIST(A186,#REF!,FALSE)","v":{"$error":"#REF!"}},{"$error":"#REF!"},{"$error":"#REF!"}]
[{"$error":"#REF!"},{"$f":"_xlfn.CHISQ.DIST(A187,#REF!,FALSE)","v":{"$error":"#REF!"}},{"$error":"#REF!"},{"$error":"#REF!"}]
[{"$error":"#REF!"},{"$f":"_xlfn.CHISQ.DIST(A188,#REF!,FALSE)","v":{"$error":"#REF!"}},{"$error":"#REF!"},{"$error":"#REF!"}]
[{"$error":"#REF!"},{"$f":"_xlfn.CHISQ.DIST(A189,#REF!,FALSE)","v":{"$error":"#REF!"}},{"$error":"#REF!"},{"$error":"#REF!"}]
[{"$error":"#REF!"},{"$f":"_xlfn.CHISQ.DIST(A190,#REF!,FALSE)","v":{"$error":"#REF!"}},{"$error":"#REF!"},{"$error":"#REF!"}]
[{"$error":"#REF!"},{"$f":"_xlfn.CHISQ.DIST(A191,#REF!,FALSE)","v":{"$error":"#REF!"}},{"$error":"#REF!"},{"$error":"#REF!"}]
[{"$error":"#REF!"},{"$f":"_xlfn.CHISQ.DIST(A192,#REF!,FALSE)","v":{"$error":"#REF!"}},{"$error":"#REF!"},{"$error":"#REF!"}]
[{"$error":"#REF!"},{"$f":"_xlfn.CHISQ.DIST(A193,#REF!,FALSE)","v":{"$error":"#REF!"}},{"$error":"#REF!"},{"$error":"#REF!"}]
[{"$error":"#REF!"},{"$f":"_xlfn.CHISQ.DIST(A194,#REF!,FALSE)","v":{"$error":"#REF!"}},{"$error":"#REF!"},{"$error":"#REF!"}]
[{"$error":"#REF!"},{"$f":"_xlfn.CHISQ.DIST(A195,#REF!,FALSE)","v":{"$error":"#REF!"}},{"$error":"#REF!"},{"$error":"#REF!"}]
[{"$error":"#REF!"},{"$f":"_xlfn.CHISQ.DIST(A196,#REF!,FALSE)","v":{"$error":"#REF!"}},{"$error":"#REF!"},{"$error":"#REF!"}]
[{"$error":"#REF!"},{"$f":"_xlfn.CHISQ.DIST(A197,#REF!,FALSE)","v":{"$error":"#REF!"}},{"$error":"#REF!"},{"$error":"#REF!"}]
[{"$error":"#REF!"},{"$f":"_xlfn.CHISQ.DIST(A198,#REF!,FALSE)","v":{"$error":"#REF!"}},{"$error":"#REF!"},{"$error":"#REF!"}]
[{"$error":"#REF!"},{"$f":"_xlfn.CHISQ.DIST(A199,#REF!,FALSE)","v":{"$error":"#REF!"}},{"$error":"#REF!"},{"$error":"#REF!"}]
[{"$error":"#REF!"},{"$f":"_xlfn.CHISQ.DIST(A200,#REF!,FALSE)","v":{"$error":"#REF!"}},{"$error":"#REF!"},{"$error":"#REF!"}]
[{"$error":"#REF!"},{"$f":"_xlfn.CHISQ.DIST(A201,#REF!,FALSE)","v":{"$error":"#REF!"}},{"$f":"IF($A201<$D$3,IF($A202>$D$3,MAX($B$9:$B$1009),\"\"),\"\")","v":{"$error":"#REF!"}},{"$f":"IF($A201<$D$4,IF($A202>$D$4,MAX($B$9:$B$1009),\"\"),\"\")","v":{"$error":"#REF!"}}]
[{"$f":"+A201+$B$4","v":{"$error":"#REF!"}},{"$f":"_xlfn.CHISQ.DIST(A202,#REF!,FALSE)","v":{"$error":"#REF!"}},{"$error":"#REF!"},{"$error":"#REF!"}]
[{"$error":"#REF!"},{"$f":"_xlfn.CHISQ.DIST(A203,#REF!,FALSE)","v":{"$error":"#REF!"}},{"$error":"#REF!"},{"$error":"#REF!"}]
[{"$error":"#REF!"},{"$f":"_xlfn.CHISQ.DIST(A204,#REF!,FALSE)","v":{"$error":"#REF!"}},{"$error":"#REF!"},{"$error":"#REF!"}]
[{"$error":"#REF!"},{"$f":"_xlfn.CHISQ.DIST(A205,#REF!,FALSE)","v":{"$error":"#REF!"}},{"$error":"#REF!"},{"$error":"#REF!"}]
[{"$error":"#REF!"},{"$f":"_xlfn.CHISQ.DIST(A206,#REF!,FALSE)","v":{"$error":"#REF!"}},{"$error":"#REF!"},{"$error":"#REF!"}]
[{"$error":"#REF!"},{"$f":"_xlfn.CHISQ.DIST(A207,#REF!,FALSE)","v":{"$error":"#REF!"}},{"$error":"#REF!"},{"$error":"#REF!"}]
[{"$error":"#REF!"},{"$f":"_xlfn.CHISQ.DIST(A208,#REF!,FALSE)","v":{"$error":"#REF!"}},{"$f":"IF($A208<$D$3,IF($A209>$D$3,MAX($B$9:$B$1009),\"\"),\"\")","v":{"$error":"#REF!"}},{"$error":"#REF!"}]
[{"$error":"#REF!"},{"$f":"_xlfn.CHISQ.DIST(A209,#REF!,FALSE)","v":{"$error":"#REF!"}},{"$error":"#REF!"},{"$error":"#REF!"}]
[{"$error":"#REF!"},{"$f":"_xlfn.CHISQ.DIST(A210,#REF!,FALSE)","v":{"$error":"#REF!"}},{"$error":"#REF!"},{"$error":"#REF!"}]
[{"$error":"#REF!"},{"$f":"_xlfn.CHISQ.DIST(A211,#REF!,FALSE)","v":{"$error":"#REF!"}},{"$error":"#REF!"},{"$error":"#REF!"}]
[{"$error":"#REF!"},{"$f":"_xlfn.CHISQ.DIST(A212,#REF!,FALSE)","v":{"$error":"#REF!"}},{"$error":"#REF!"},{"$error":"#REF!"}]
[{"$error":"#REF!"},{"$f":"_xlfn.CHISQ.DIST(A213,#REF!,FALSE)","v":{"$error":"#REF!"}},{"$error":"#REF!"},{"$error":"#REF!"}]
[{"$error":"#REF!"},{"$f":"_xlfn.CHISQ.DIST(A214,#REF!,FALSE)","v":{"$error":"#REF!"}},{"$error":"#REF!"},{"$error":"#REF!"}]
[{"$error":"#REF!"},{"$f":"_xlfn.CHISQ.DIST(A215,#REF!,FALSE)","v":{"$error":"#REF!"}},{"$error":"#REF!"},{"$error":"#REF!"}]
[{"$error":"#REF!"},{"$f":"_xlfn.CHISQ.DIST(A216,#REF!,FALSE)","v":{"$error":"#REF!"}},{"$error":"#REF!"},{"$error":"#REF!"}]
[{"$error":"#REF!"},{"$f":"_xlfn.CHISQ.DIST(A217,#REF!,FALSE)","v":{"$error":"#REF!"}},{"$error":"#REF!"},{"$error":"#REF!"}]
[{"$error":"#REF!"},{"$f":"_xlfn.CHISQ.DIST(A218,#REF!,FALSE)","v":{"$error":"#REF!"}},{"$error":"#REF!"},{"$error":"#REF!"}]
[{"$error":"#REF!"},{"$f":"_xlfn.CHISQ.DIST(A219,#REF!,FALSE)","v":{"$error":"#REF!"}},{"$error":"#REF!"},{"$error":"#REF!"}]
[{"$error":"#REF!"},{"$f":"_xlfn.CHISQ.DIST(A220,#REF!,FALSE)","v":{"$error":"#REF!"}},{"$error":"#REF!"},{"$error":"#REF!"}]
[{"$error":"#REF!"},{"$f":"_xlfn.CHISQ.DIST(A221,#REF!,FALSE)","v":{"$error":"#REF!"}},{"$error":"#REF!"},{"$error":"#REF!"}]
[{"$error":"#REF!"},{"$f":"_xlfn.CHISQ.DIST(A222,#REF!,FALSE)","v":{"$error":"#REF!"}},{"$error":"#REF!"},{"$error":"#REF!"}]
[{"$error":"#REF!"},{"$f":"_xlfn.CHISQ.DIST(A223,#REF!,FALSE)","v":{"$error":"#REF!"}},{"$error":"#REF!"},{"$error":"#REF!"}]
[{"$error":"#REF!"},{"$f":"_xlfn.CHISQ.DIST(A224,#REF!,FALSE)","v":{"$error":"#REF!"}},{"$error":"#REF!"},{"$error":"#REF!"}]
[{"$error":"#REF!"},{"$f":"_xlfn.CHISQ.DIST(A225,#REF!,FALSE)","v":{"$error":"#REF!"}},{"$error":"#REF!"},{"$error":"#REF!"}]
[{"$error":"#REF!"},{"$f":"_xlfn.CHISQ.DIST(A226,#REF!,FALSE)","v":{"$error":"#REF!"}},{"$error":"#REF!"},{"$error":"#REF!"}]
[{"$error":"#REF!"},{"$f":"_xlfn.CHISQ.DIST(A227,#REF!,FALSE)","v":{"$error":"#REF!"}},{"$error":"#REF!"},{"$error":"#REF!"}]
[{"$error":"#REF!"},{"$f":"_xlfn.CHISQ.DIST(A228,#REF!,FALSE)","v":{"$error":"#REF!"}},{"$error":"#REF!"},{"$error":"#REF!"}]
[{"$error":"#REF!"},{"$f":"_xlfn.CHISQ.DIST(A229,#REF!,FALSE)","v":{"$error":"#REF!"}},{"$error":"#REF!"},{"$error":"#REF!"}]
[{"$error":"#REF!"},{"$f":"_xlfn.CHISQ.DIST(A230,#REF!,FALSE)","v":{"$error":"#REF!"}},{"$error":"#REF!"},{"$error":"#REF!"}]
[{"$error":"#REF!"},{"$f":"_xlfn.CHISQ.DIST(A231,#REF!,FALSE)","v":{"$error":"#REF!"}},{"$error":"#REF!"},{"$error":"#REF!"}]
[{"$error":"#REF!"},{"$f":"_xlfn.CHISQ.DIST(A232,#REF!,FALSE)","v":{"$error":"#REF!"}},{"$error":"#REF!"},{"$error":"#REF!"}]
[{"$error":"#REF!"},{"$f":"_xlfn.CHISQ.DIST(A233,#REF!,FALSE)","v":{"$error":"#REF!"}},{"$error":"#REF!"},{"$error":"#REF!"}]
[{"$error":"#REF!"},{"$f":"_xlfn.CHISQ.DIST(A234,#REF!,FALSE)","v":{"$error":"#REF!"}},{"$error":"#REF!"},{"$error":"#REF!"}]
[{"$error":"#REF!"},{"$f":"_xlfn.CHISQ.DIST(A235,#REF!,FALSE)","v":{"$error":"#REF!"}},{"$error":"#REF!"},{"$error":"#REF!"}]
[{"$error":"#REF!"},{"$f":"_xlfn.CHISQ.DIST(A236,#REF!,FALSE)","v":{"$error":"#REF!"}},{"$error":"#REF!"},{"$error":"#REF!"}]
[{"$error":"#REF!"},{"$f":"_xlfn.CHISQ.DIST(A237,#REF!,FALSE)","v":{"$error":"#REF!"}},{"$error":"#REF!"},{"$error":"#REF!"}]
[{"$error":"#REF!"},{"$f":"_xlfn.CHISQ.DIST(A238,#REF!,FALSE)","v":{"$error":"#REF!"}},{"$error":"#REF!"},{"$error":"#REF!"}]
[{"$error":"#REF!"},{"$f":"_xlfn.CHISQ.DIST(A239,#REF!,FALSE)","v":{"$error":"#REF!"}},{"$error":"#REF!"},{"$error":"#REF!"}]
[{"$error":"#REF!"},{"$f":"_xlfn.CHISQ.DIST(A240,#REF!,FALSE)","v":{"$error":"#REF!"}},{"$error":"#REF!"},{"$error":"#REF!"}]
[{"$error":"#REF!"},{"$f":"_xlfn.CHISQ.DIST(A241,#REF!,FALSE)","v":{"$error":"#REF!"}},{"$error":"#REF!"},{"$error":"#REF!"}]
[{"$error":"#REF!"},{"$f":"_xlfn.CHISQ.DIST(A242,#REF!,FALSE)","v":{"$error":"#REF!"}},{"$error":"#REF!"},{"$error":"#REF!"}]
[{"$error":"#REF!"},{"$f":"_xlfn.CHISQ.DIST(A243,#REF!,FALSE)","v":{"$error":"#REF!"}},{"$error":"#REF!"},{"$error":"#REF!"}]
[{"$error":"#REF!"},{"$f":"_xlfn.CHISQ.DIST(A244,#REF!,FALSE)","v":{"$error":"#REF!"}},{"$error":"#REF!"},{"$error":"#REF!"}]
[{"$error":"#REF!"},{"$f":"_xlfn.CHISQ.DIST(A245,#REF!,FALSE)","v":{"$error":"#REF!"}},{"$error":"#REF!"},{"$error":"#REF!"}]
[{"$error":"#REF!"},{"$f":"_xlfn.CHISQ.DIST(A246,#REF!,FALSE)","v":{"$error":"#REF!"}},{"$error":"#REF!"},{"$error":"#REF!"}]
[{"$error":"#REF!"},{"$f":"_xlfn.CHISQ.DIST(A247,#REF!,FALSE)","v":{"$error":"#REF!"}},{"$error":"#REF!"},{"$error":"#REF!"}]
[{"$error":"#REF!"},{"$f":"_xlfn.CHISQ.DIST(A248,#REF!,FALSE)","v":{"$error":"#REF!"}},{"$error":"#REF!"},{"$error":"#REF!"}]
[{"$error":"#REF!"},{"$f":"_xlfn.CHISQ.DIST(A249,#REF!,FALSE)","v":{"$error":"#REF!"}},{"$error":"#REF!"},{"$error":"#REF!"}]
[{"$error":"#REF!"},{"$f":"_xlfn.CHISQ.DIST(A250,#REF!,FALSE)","v":{"$error":"#REF!"}},{"$error":"#REF!"},{"$error":"#REF!"}]
[{"$error":"#REF!"},{"$f":"_xlfn.CHISQ.DIST(A251,#REF!,FALSE)","v":{"$error":"#REF!"}},{"$error":"#REF!"},{"$error":"#REF!"}]
[{"$error":"#REF!"},{"$f":"_xlfn.CHISQ.DIST(A252,#REF!,FALSE)","v":{"$error":"#REF!"}},{"$error":"#REF!"},{"$error":"#REF!"}]
[{"$error":"#REF!"},{"$f":"_xlfn.CHISQ.DIST(A253,#REF!,FALSE)","v":{"$error":"#REF!"}},{"$error":"#REF!"},{"$error":"#REF!"}]
[{"$error":"#REF!"},{"$f":"_xlfn.CHISQ.DIST(A254,#REF!,FALSE)","v":{"$error":"#REF!"}},{"$error":"#REF!"},{"$error":"#REF!"}]
[{"$error":"#REF!"},{"$f":"_xlfn.CHISQ.DIST(A255,#REF!,FALSE)","v":{"$error":"#REF!"}},{"$error":"#REF!"},{"$error":"#REF!"}]
[{"$error":"#REF!"},{"$f":"_xlfn.CHISQ.DIST(A256,#REF!,FALSE)","v":{"$error":"#REF!"}},{"$error":"#REF!"},{"$error":"#REF!"}]
[{"$error":"#REF!"},{"$f":"_xlfn.CHISQ.DIST(A257,#REF!,FALSE)","v":{"$error":"#REF!"}},{"$error":"#REF!"},{"$error":"#REF!"}]
[{"$error":"#REF!"},{"$f":"_xlfn.CHISQ.DIST(A258,#REF!,FALSE)","v":{"$error":"#REF!"}},{"$error":"#REF!"},{"$error":"#REF!"}]
[{"$error":"#REF!"},{"$f":"_xlfn.CHISQ.DIST(A259,#REF!,FALSE)","v":{"$error":"#REF!"}},{"$error":"#REF!"},{"$error":"#REF!"}]
[{"$error":"#REF!"},{"$f":"_xlfn.CHISQ.DIST(A260,#REF!,FALSE)","v":{"$error":"#REF!"}},{"$error":"#REF!"},{"$error":"#REF!"}]
[{"$error":"#REF!"},{"$f":"_xlfn.CHISQ.DIST(A261,#REF!,FALSE)","v":{"$error":"#REF!"}},{"$error":"#REF!"},{"$error":"#REF!"}]
[{"$error":"#REF!"},{"$f":"_xlfn.CHISQ.DIST(A262,#REF!,FALSE)","v":{"$error":"#REF!"}},{"$error":"#REF!"},{"$error":"#REF!"}]
[{"$error":"#REF!"},{"$f":"_xlfn.CHISQ.DIST(A263,#REF!,FALSE)","v":{"$error":"#REF!"}},{"$error":"#REF!"},{"$error":"#REF!"}]
[{"$error":"#REF!"},{"$f":"_xlfn.CHISQ.DIST(A264,#REF!,FALSE)","v":{"$error":"#REF!"}},{"$error":"#REF!"},{"$error":"#REF!"}]
[{"$error":"#REF!"},{"$f":"_xlfn.CHISQ.DIST(A265,#REF!,FALSE)","v":{"$error":"#REF!"}},{"$f":"IF($A265<$D$3,IF($A266>$D$3,MAX($B$9:$B$1009),\"\"),\"\")","v":{"$error":"#REF!"}},{"$f":"IF($A265<$D$4,IF($A266>$D$4,MAX($B$9:$B$1009),\"\"),\"\")","v":{"$error":"#REF!"}}]
[{"$f":"+A265+$B$4","v":{"$error":"#REF!"}},{"$f":"_xlfn.CHISQ.DIST(A266,#REF!,FALSE)","v":{"$error":"#REF!"}},{"$error":"#REF!"},{"$error":"#REF!"}]
[{"$error":"#REF!"},{"$f":"_xlfn.CHISQ.DIST(A267,#REF!,FALSE)","v":{"$error":"#REF!"}},{"$error":"#REF!"},{"$error":"#REF!"}]
[{"$error":"#REF!"},{"$f":"_xlfn.CHISQ.DIST(A268,#REF!,FALSE)","v":{"$error":"#REF!"}},{"$error":"#REF!"},{"$error":"#REF!"}]
[{"$error":"#REF!"},{"$f":"_xlfn.CHISQ.DIST(A269,#REF!,FALSE)","v":{"$error":"#REF!"}},{"$error":"#REF!"},{"$error":"#REF!"}]
[{"$error":"#REF!"},{"$f":"_xlfn.CHISQ.DIST(A270,#REF!,FALSE)","v":{"$error":"#REF!"}},{"$error":"#REF!"},{"$error":"#REF!"}]
[{"$error":"#REF!"},{"$f":"_xlfn.CHISQ.DIST(A271,#REF!,FALSE)","v":{"$error":"#REF!"}},{"$error":"#REF!"},{"$error":"#REF!"}]
[{"$error":"#REF!"},{"$f":"_xlfn.CHISQ.DIST(A272,#REF!,FALSE)","v":{"$error":"#REF!"}},{"$error":"#REF!"},{"$error":"#REF!"}]
[{"$error":"#REF!"},{"$f":"_xlfn.CHISQ.DIST(A273,#REF!,FALSE)","v":{"$error":"#REF!"}},{"$error":"#REF!"},{"$error":"#REF!"}]
[{"$error":"#REF!"},{"$f":"_xlfn.CHISQ.DIST(A274,#REF!,FALSE)","v":{"$error":"#REF!"}},{"$error":"#REF!"},{"$error":"#REF!"}]
[{"$error":"#REF!"},{"$f":"_xlfn.CHISQ.DIST(A275,#REF!,FALSE)","v":{"$error":"#REF!"}},{"$error":"#REF!"},{"$error":"#REF!"}]
[{"$error":"#REF!"},{"$f":"_xlfn.CHISQ.DIST(A276,#REF!,FALSE)","v":{"$error":"#REF!"}},{"$error":"#REF!"},{"$error":"#REF!"}]
[{"$error":"#REF!"},{"$f":"_xlfn.CHISQ.DIST(A277,#REF!,FALSE)","v":{"$error":"#REF!"}},{"$error":"#REF!"},{"$error":"#REF!"}]
[{"$error":"#REF!"},{"$f":"_xlfn.CHISQ.DIST(A278,#REF!,FALSE)","v":{"$error":"#REF!"}},{"$error":"#REF!"},{"$error":"#REF!"}]
[{"$error":"#REF!"},{"$f":"_xlfn.CHISQ.DIST(A279,#REF!,FALSE)","v":{"$error":"#REF!"}},{"$error":"#REF!"},{"$error":"#REF!"}]
[{"$error":"#REF!"},{"$f":"_xlfn.CHISQ.DIST(A280,#REF!,FALSE)","v":{"$error":"#REF!"}},{"$error":"#REF!"},{"$error":"#REF!"}]
[{"$error":"#REF!"},{"$f":"_xlfn.CHISQ.DIST(A281,#REF!,FALSE)","v":{"$error":"#REF!"}},{"$error":"#REF!"},{"$error":"#REF!"}]
[{"$error":"#REF!"},{"$f":"_xlfn.CHISQ.DIST(A282,#REF!,FALSE)","v":{"$error":"#REF!"}},{"$error":"#REF!"},{"$error":"#REF!"}]
[{"$error":"#REF!"},{"$f":"_xlfn.CHISQ.DIST(A283,#REF!,FALSE)","v":{"$error":"#REF!"}},{"$error":"#REF!"},{"$error":"#REF!"}]
[{"$error":"#REF!"},{"$f":"_xlfn.CHISQ.DIST(A284,#REF!,FALSE)","v":{"$error":"#REF!"}},{"$error":"#REF!"},{"$error":"#REF!"}]
[{"$error":"#REF!"},{"$f":"_xlfn.CHISQ.DIST(A285,#REF!,FALSE)","v":{"$error":"#REF!"}},{"$error":"#REF!"},{"$error":"#REF!"}]
[{"$error":"#REF!"},{"$f":"_xlfn.CHISQ.DIST(A286,#REF!,FALSE)","v":{"$error":"#REF!"}},{"$error":"#REF!"},{"$error":"#REF!"}]
[{"$error":"#REF!"},{"$f":"_xlfn.CHISQ.DIST(A287,#REF!,FALSE)","v":{"$error":"#REF!"}},{"$error":"#REF!"},{"$error":"#REF!"}]
[{"$error":"#REF!"},{"$f":"_xlfn.CHISQ.DIST(A288,#REF!,FALSE)","v":{"$error":"#REF!"}},{"$error":"#REF!"},{"$error":"#REF!"}]
[{"$error":"#REF!"},{"$f":"_xlfn.CHISQ.DIST(A289,#REF!,FALSE)","v":{"$error":"#REF!"}},{"$error":"#REF!"},{"$error":"#REF!"}]
[{"$error":"#REF!"},{"$f":"_xlfn.CHISQ.DIST(A290,#REF!,FALSE)","v":{"$error":"#REF!"}},{"$error":"#REF!"},{"$error":"#REF!"}]
[{"$error":"#REF!"},{"$f":"_xlfn.CHISQ.DIST(A291,#REF!,FALSE)","v":{"$error":"#REF!"}},{"$error":"#REF!"},{"$error":"#REF!"}]
[{"$error":"#REF!"},{"$f":"_xlfn.CHISQ.DIST(A292,#REF!,FALSE)","v":{"$error":"#REF!"}},{"$error":"#REF!"},{"$error":"#REF!"}]
[{"$error":"#REF!"},{"$f":"_xlfn.CHISQ.DIST(A293,#REF!,FALSE)","v":{"$error":"#REF!"}},{"$error":"#REF!"},{"$error":"#REF!"}]
[{"$error":"#REF!"},{"$f":"_xlfn.CHISQ.DIST(A294,#REF!,FALSE)","v":{"$error":"#REF!"}},{"$error":"#REF!"},{"$error":"#REF!"}]
[{"$error":"#REF!"},{"$f":"_xlfn.CHISQ.DIST(A295,#REF!,FALSE)","v":{"$error":"#REF!"}},{"$error":"#REF!"},{"$error":"#REF!"}]
[{"$error":"#REF!"},{"$f":"_xlfn.CHISQ.DIST(A296,#REF!,FALSE)","v":{"$error":"#REF!"}},{"$error":"#REF!"},{"$error":"#REF!"}]
[{"$error":"#REF!"},{"$f":"_xlfn.CHISQ.DIST(A297,#REF!,FALSE)","v":{"$error":"#REF!"}},{"$error":"#REF!"},{"$error":"#REF!"}]
[{"$error":"#REF!"},{"$f":"_xlfn.CHISQ.DIST(A298,#REF!,FALSE)","v":{"$error":"#REF!"}},{"$error":"#REF!"},{"$error":"#REF!"}]
[{"$error":"#REF!"},{"$f":"_xlfn.CHISQ.DIST(A299,#REF!,FALSE)","v":{"$error":"#REF!"}},{"$error":"#REF!"},{"$error":"#REF!"}]
[{"$error":"#REF!"},{"$f":"_xlfn.CHISQ.DIST(A300,#REF!,FALSE)","v":{"$error":"#REF!"}},{"$error":"#REF!"},{"$error":"#REF!"}]
[{"$error":"#REF!"},{"$f":"_xlfn.CHISQ.DIST(A301,#REF!,FALSE)","v":{"$error":"#REF!"}},{"$error":"#REF!"},{"$error":"#REF!"}]
[{"$error":"#REF!"},{"$f":"_xlfn.CHISQ.DIST(A302,#REF!,FALSE)","v":{"$error":"#REF!"}},{"$error":"#REF!"},{"$error":"#REF!"}]
[{"$error":"#REF!"},{"$f":"_xlfn.CHISQ.DIST(A303,#REF!,FALSE)","v":{"$error":"#REF!"}},{"$error":"#REF!"},{"$error":"#REF!"}]
[{"$error":"#REF!"},{"$f":"_xlfn.CHISQ.DIST(A304,#REF!,FALSE)","v":{"$error":"#REF!"}},{"$error":"#REF!"},{"$error":"#REF!"}]
[{"$error":"#REF!"},{"$f":"_xlfn.CHISQ.DIST(A305,#REF!,FALSE)","v":{"$error":"#REF!"}},{"$error":"#REF!"},{"$error":"#REF!"}]
[{"$error":"#REF!"},{"$f":"_xlfn.CHISQ.DIST(A306,#REF!,FALSE)","v":{"$error":"#REF!"}},{"$error":"#REF!"},{"$error":"#REF!"}]
[{"$error":"#REF!"},{"$f":"_xlfn.CHISQ.DIST(A307,#REF!,FALSE)","v":{"$error":"#REF!"}},{"$error":"#REF!"},{"$error":"#REF!"}]
[{"$error":"#REF!"},{"$f":"_xlfn.CHISQ.DIST(A308,#REF!,FALSE)","v":{"$error":"#REF!"}},{"$error":"#REF!"},{"$error":"#REF!"}]
[{"$error":"#REF!"},{"$f":"_xlfn.CHISQ.DIST(A309,#REF!,FALSE)","v":{"$error":"#REF!"}},{"$error":"#REF!"},{"$error":"#REF!"}]
[{"$error":"#REF!"},{"$f":"_xlfn.CHISQ.DIST(A310,#REF!,FALSE)","v":{"$error":"#REF!"}},{"$error":"#REF!"},{"$error":"#REF!"}]
[{"$error":"#REF!"},{"$f":"_xlfn.CHISQ.DIST(A311,#REF!,FALSE)","v":{"$error":"#REF!"}},{"$error":"#REF!"},{"$error":"#REF!"}]
[{"$error":"#REF!"},{"$f":"_xlfn.CHISQ.DIST(A312,#REF!,FALSE)","v":{"$error":"#REF!"}},{"$error":"#REF!"},{"$error":"#REF!"}]
[{"$error":"#REF!"},{"$f":"_xlfn.CHISQ.DIST(A313,#REF!,FALSE)","v":{"$error":"#REF!"}},{"$error":"#REF!"},{"$error":"#REF!"}]
[{"$error":"#REF!"},{"$f":"_xlfn.CHISQ.DIST(A314,#REF!,FALSE)","v":{"$error":"#REF!"}},{"$error":"#REF!"},{"$error":"#REF!"}]
[{"$error":"#REF!"},{"$f":"_xlfn.CHISQ.DIST(A315,#REF!,FALSE)","v":{"$error":"#REF!"}},{"$error":"#REF!"},{"$error":"#REF!"}]
[{"$error":"#REF!"},{"$f":"_xlfn.CHISQ.DIST(A316,#REF!,FALSE)","v":{"$error":"#REF!"}},{"$error":"#REF!"},{"$error":"#REF!"}]
[{"$error":"#REF!"},{"$f":"_xlfn.CHISQ.DIST(A317,#REF!,FALSE)","v":{"$error":"#REF!"}},{"$error":"#REF!"},{"$error":"#REF!"}]
[{"$error":"#REF!"},{"$f":"_xlfn.CHISQ.DIST(A318,#REF!,FALSE)","v":{"$error":"#REF!"}},{"$error":"#REF!"},{"$error":"#REF!"}]
[{"$error":"#REF!"},{"$f":"_xlfn.CHISQ.DIST(A319,#REF!,FALSE)","v":{"$error":"#REF!"}},{"$error":"#REF!"},{"$error":"#REF!"}]
[{"$error":"#REF!"},{"$f":"_xlfn.CHISQ.DIST(A320,#REF!,FALSE)","v":{"$error":"#REF!"}},{"$error":"#REF!"},{"$error":"#REF!"}]
[{"$error":"#REF!"},{"$f":"_xlfn.CHISQ.DIST(A321,#REF!,FALSE)","v":{"$error":"#REF!"}},{"$error":"#REF!"},{"$error":"#REF!"}]
[{"$error":"#REF!"},{"$f":"_xlfn.CHISQ.DIST(A322,#REF!,FALSE)","v":{"$error":"#REF!"}},{"$error":"#REF!"},{"$error":"#REF!"}]
[{"$error":"#REF!"},{"$f":"_xlfn.CHISQ.DIST(A323,#REF!,FALSE)","v":{"$error":"#REF!"}},{"$error":"#REF!"},{"$error":"#REF!"}]
[{"$error":"#REF!"},{"$f":"_xlfn.CHISQ.DIST(A324,#REF!,FALSE)","v":{"$error":"#REF!"}},{"$error":"#REF!"},{"$error":"#REF!"}]
[{"$error":"#REF!"},{"$f":"_xlfn.CHISQ.DIST(A325,#REF!,FALSE)","v":{"$error":"#REF!"}},{"$error":"#REF!"},{"$error":"#REF!"}]
[{"$error":"#REF!"},{"$f":"_xlfn.CHISQ.DIST(A326,#REF!,FALSE)","v":{"$error":"#REF!"}},{"$error":"#REF!"},{"$error":"#REF!"}]
[{"$error":"#REF!"},{"$f":"_xlfn.CHISQ.DIST(A327,#REF!,FALSE)","v":{"$error":"#REF!"}},{"$error":"#REF!"},{"$error":"#REF!"}]
[{"$error":"#REF!"},{"$f":"_xlfn.CHISQ.DIST(A328,#REF!,FALSE)","v":{"$error":"#REF!"}},{"$error":"#REF!"},{"$error":"#REF!"}]
[{"$error":"#REF!"},{"$f":"_xlfn.CHISQ.DIST(A329,#REF!,FALSE)","v":{"$error":"#REF!"}},{"$f":"IF($A329<$D$3,IF($A330>$D$3,MAX($B$9:$B$1009),\"\"),\"\")","v":{"$error":"#REF!"}},{"$f":"IF($A329<$D$4,IF($A330>$D$4,MAX($B$9:$B$1009),\"\"),\"\")","v":{"$error":"#REF!"}}]
[{"$f":"+A329+$B$4","v":{"$error":"#REF!"}},{"$f":"_xlfn.CHISQ.DIST(A330,#REF!,FALSE)","v":{"$error":"#REF!"}},{"$error":"#REF!"},{"$error":"#REF!"}]
[{"$error":"#REF!"},{"$f":"_xlfn.CHISQ.DIST(A331,#REF!,FALSE)","v":{"$error":"#REF!"}},{"$error":"#REF!"},{"$error":"#REF!"}]
[{"$error":"#REF!"},{"$f":"_xlfn.CHISQ.DIST(A332,#REF!,FALSE)","v":{"$error":"#REF!"}},{"$error":"#REF!"},{"$error":"#REF!"}]
[{"$error":"#REF!"},{"$f":"_xlfn.CHISQ.DIST(A333,#REF!,FALSE)","v":{"$error":"#REF!"}},{"$error":"#REF!"},{"$error":"#REF!"}]
[{"$error":"#REF!"},{"$f":"_xlfn.CHISQ.DIST(A334,#REF!,FALSE)","v":{"$error":"#REF!"}},{"$error":"#REF!"},{"$error":"#REF!"}]
[{"$error":"#REF!"},{"$f":"_xlfn.CHISQ.DIST(A335,#REF!,FALSE)","v":{"$error":"#REF!"}},{"$error":"#REF!"},{"$error":"#REF!"}]
[{"$error":"#REF!"},{"$f":"_xlfn.CHISQ.DIST(A336,#REF!,FALSE)","v":{"$error":"#REF!"}},{"$error":"#REF!"},{"$error":"#REF!"}]
[{"$error":"#REF!"},{"$f":"_xlfn.CHISQ.DIST(A337,#REF!,FALSE)","v":{"$error":"#REF!"}},{"$error":"#REF!"},{"$error":"#REF!"}]
[{"$error":"#REF!"},{"$f":"_xlfn.CHISQ.DIST(A338,#REF!,FALSE)","v":{"$error":"#REF!"}},{"$error":"#REF!"},{"$error":"#REF!"}]
[{"$error":"#REF!"},{"$f":"_xlfn.CHISQ.DIST(A339,#REF!,FALSE)","v":{"$error":"#REF!"}},{"$error":"#REF!"},{"$error":"#REF!"}]
[{"$error":"#REF!"},{"$f":"_xlfn.CHISQ.DIST(A340,#REF!,FALSE)","v":{"$error":"#REF!"}},{"$error":"#REF!"},{"$error":"#REF!"}]
[{"$error":"#REF!"},{"$f":"_xlfn.CHISQ.DIST(A341,#REF!,FALSE)","v":{"$error":"#REF!"}},{"$error":"#REF!"},{"$error":"#REF!"}]
[{"$error":"#REF!"},{"$f":"_xlfn.CHISQ.DIST(A342,#REF!,FALSE)","v":{"$error":"#REF!"}},{"$error":"#REF!"},{"$error":"#REF!"}]
[{"$error":"#REF!"},{"$f":"_xlfn.CHISQ.DIST(A343,#REF!,FALSE)","v":{"$error":"#REF!"}},{"$error":"#REF!"},{"$error":"#REF!"}]
[{"$error":"#REF!"},{"$f":"_xlfn.CHISQ.DIST(A344,#REF!,FALSE)","v":{"$error":"#REF!"}},{"$error":"#REF!"},{"$error":"#REF!"}]
[{"$error":"#REF!"},{"$f":"_xlfn.CHISQ.DIST(A345,#REF!,FALSE)","v":{"$error":"#REF!"}},{"$error":"#REF!"},{"$error":"#REF!"}]
[{"$error":"#REF!"},{"$f":"_xlfn.CHISQ.DIST(A346,#REF!,FALSE)","v":{"$error":"#REF!"}},{"$error":"#REF!"},{"$error":"#REF!"}]
[{"$error":"#REF!"},{"$f":"_xlfn.CHISQ.DIST(A347,#REF!,FALSE)","v":{"$error":"#REF!"}},{"$error":"#REF!"},{"$error":"#REF!"}]
[{"$error":"#REF!"},{"$f":"_xlfn.CHISQ.DIST(A348,#REF!,FALSE)","v":{"$error":"#REF!"}},{"$error":"#REF!"},{"$error":"#REF!"}]
[{"$error":"#REF!"},{"$f":"_xlfn.CHISQ.DIST(A349,#REF!,FALSE)","v":{"$error":"#REF!"}},{"$error":"#REF!"},{"$error":"#REF!"}]
[{"$error":"#REF!"},{"$f":"_xlfn.CHISQ.DIST(A350,#REF!,FALSE)","v":{"$error":"#REF!"}},{"$error":"#REF!"},{"$error":"#REF!"}]
[{"$error":"#REF!"},{"$f":"_xlfn.CHISQ.DIST(A351,#REF!,FALSE)","v":{"$error":"#REF!"}},{"$error":"#REF!"},{"$error":"#REF!"}]
[{"$error":"#REF!"},{"$f":"_xlfn.CHISQ.DIST(A352,#REF!,FALSE)","v":{"$error":"#REF!"}},{"$error":"#REF!"},{"$error":"#REF!"}]
[{"$error":"#REF!"},{"$f":"_xlfn.CHISQ.DIST(A353,#REF!,FALSE)","v":{"$error":"#REF!"}},{"$error":"#REF!"},{"$error":"#REF!"}]
[{"$error":"#REF!"},{"$f":"_xlfn.CHISQ.DIST(A354,#REF!,FALSE)","v":{"$error":"#REF!"}},{"$error":"#REF!"},{"$error":"#REF!"}]
[{"$error":"#REF!"},{"$f":"_xlfn.CHISQ.DIST(A355,#REF!,FALSE)","v":{"$error":"#REF!"}},{"$error":"#REF!"},{"$error":"#REF!"}]
[{"$error":"#REF!"},{"$f":"_xlfn.CHISQ.DIST(A356,#REF!,FALSE)","v":{"$error":"#REF!"}},{"$error":"#REF!"},{"$error":"#REF!"}]
[{"$error":"#REF!"},{"$f":"_xlfn.CHISQ.DIST(A357,#REF!,FALSE)","v":{"$error":"#REF!"}},{"$error":"#REF!"},{"$error":"#REF!"}]
[{"$error":"#REF!"},{"$f":"_xlfn.CHISQ.DIST(A358,#REF!,FALSE)","v":{"$error":"#REF!"}},{"$error":"#REF!"},{"$error":"#REF!"}]
[{"$error":"#REF!"},{"$f":"_xlfn.CHISQ.DIST(A359,#REF!,FALSE)","v":{"$error":"#REF!"}},{"$error":"#REF!"},{"$error":"#REF!"}]
[{"$error":"#REF!"},{"$f":"_xlfn.CHISQ.DIST(A360,#REF!,FALSE)","v":{"$error":"#REF!"}},{"$error":"#REF!"},{"$error":"#REF!"}]
[{"$error":"#REF!"},{"$f":"_xlfn.CHISQ.DIST(A361,#REF!,FALSE)","v":{"$error":"#REF!"}},{"$error":"#REF!"},{"$error":"#REF!"}]
[{"$error":"#REF!"},{"$f":"_xlfn.CHISQ.DIST(A362,#REF!,FALSE)","v":{"$error":"#REF!"}},{"$error":"#REF!"},{"$error":"#REF!"}]
[{"$error":"#REF!"},{"$f":"_xlfn.CHISQ.DIST(A363,#REF!,FALSE)","v":{"$error":"#REF!"}},{"$error":"#REF!"},{"$error":"#REF!"}]
[{"$error":"#REF!"},{"$f":"_xlfn.CHISQ.DIST(A364,#REF!,FALSE)","v":{"$error":"#REF!"}},{"$error":"#REF!"},{"$error":"#REF!"}]
[{"$error":"#REF!"},{"$f":"_xlfn.CHISQ.DIST(A365,#REF!,FALSE)","v":{"$error":"#REF!"}},{"$error":"#REF!"},{"$error":"#REF!"}]
[{"$error":"#REF!"},{"$f":"_xlfn.CHISQ.DIST(A366,#REF!,FALSE)","v":{"$error":"#REF!"}},{"$error":"#REF!"},{"$error":"#REF!"}]
[{"$error":"#REF!"},{"$f":"_xlfn.CHISQ.DIST(A367,#REF!,FALSE)","v":{"$error":"#REF!"}},{"$error":"#REF!"},{"$error":"#REF!"}]
[{"$error":"#REF!"},{"$f":"_xlfn.CHISQ.DIST(A368,#REF!,FALSE)","v":{"$error":"#REF!"}},{"$error":"#REF!"},{"$error":"#REF!"}]
[{"$error":"#REF!"},{"$f":"_xlfn.CHISQ.DIST(A369,#REF!,FALSE)","v":{"$error":"#REF!"}},{"$error":"#REF!"},{"$error":"#REF!"}]
[{"$error":"#REF!"},{"$f":"_xlfn.CHISQ.DIST(A370,#REF!,FALSE)","v":{"$error":"#REF!"}},{"$error":"#REF!"},{"$error":"#REF!"}]
[{"$error":"#REF!"},{"$f":"_xlfn.CHISQ.DIST(A371,#REF!,FALSE)","v":{"$error":"#REF!"}},{"$error":"#REF!"},{"$error":"#REF!"}]
[{"$error":"#REF!"},{"$f":"_xlfn.CHISQ.DIST(A372,#REF!,FALSE)","v":{"$error":"#REF!"}},{"$error":"#REF!"},{"$error":"#REF!"}]
[{"$error":"#REF!"},{"$f":"_xlfn.CHISQ.DIST(A373,#REF!,FALSE)","v":{"$error":"#REF!"}},{"$error":"#REF!"},{"$error":"#REF!"}]
[{"$error":"#REF!"},{"$f":"_xlfn.CHISQ.DIST(A374,#REF!,FALSE)","v":{"$error":"#REF!"}},{"$error":"#REF!"},{"$error":"#REF!"}]
[{"$error":"#REF!"},{"$f":"_xlfn.CHISQ.DIST(A375,#REF!,FALSE)","v":{"$error":"#REF!"}},{"$error":"#REF!"},{"$error":"#REF!"}]
[{"$error":"#REF!"},{"$f":"_xlfn.CHISQ.DIST(A376,#REF!,FALSE)","v":{"$error":"#REF!"}},{"$error":"#REF!"},{"$error":"#REF!"}]
[{"$error":"#REF!"},{"$f":"_xlfn.CHISQ.DIST(A377,#REF!,FALSE)","v":{"$error":"#REF!"}},{"$error":"#REF!"},{"$error":"#REF!"}]
[{"$error":"#REF!"},{"$f":"_xlfn.CHISQ.DIST(A378,#REF!,FALSE)","v":{"$error":"#REF!"}},{"$error":"#REF!"},{"$error":"#REF!"}]
[{"$error":"#REF!"},{"$f":"_xlfn.CHISQ.DIST(A379,#REF!,FALSE)","v":{"$error":"#REF!"}},{"$error":"#REF!"},{"$error":"#REF!"}]
[{"$error":"#REF!"},{"$f":"_xlfn.CHISQ.DIST(A380,#REF!,FALSE)","v":{"$error":"#REF!"}},{"$error":"#REF!"},{"$error":"#REF!"}]
[{"$error":"#REF!"},{"$f":"_xlfn.CHISQ.DIST(A381,#REF!,FALSE)","v":{"$error":"#REF!"}},{"$error":"#REF!"},{"$error":"#REF!"}]
[{"$error":"#REF!"},{"$f":"_xlfn.CHISQ.DIST(A382,#REF!,FALSE)","v":{"$error":"#REF!"}},{"$error":"#REF!"},{"$error":"#REF!"}]
[{"$error":"#REF!"},{"$f":"_xlfn.CHISQ.DIST(A383,#REF!,FALSE)","v":{"$error":"#REF!"}},{"$error":"#REF!"},{"$error":"#REF!"}]
[{"$error":"#REF!"},{"$f":"_xlfn.CHISQ.DIST(A384,#REF!,FALSE)","v":{"$error":"#REF!"}},{"$error":"#REF!"},{"$error":"#REF!"}]
[{"$error":"#REF!"},{"$f":"_xlfn.CHISQ.DIST(A385,#REF!,FALSE)","v":{"$error":"#REF!"}},{"$error":"#REF!"},{"$error":"#REF!"}]
[{"$error":"#REF!"},{"$f":"_xlfn.CHISQ.DIST(A386,#REF!,FALSE)","v":{"$error":"#REF!"}},{"$error":"#REF!"},{"$error":"#REF!"}]
[{"$error":"#REF!"},{"$f":"_xlfn.CHISQ.DIST(A387,#REF!,FALSE)","v":{"$error":"#REF!"}},{"$error":"#REF!"},{"$error":"#REF!"}]
[{"$error":"#REF!"},{"$f":"_xlfn.CHISQ.DIST(A388,#REF!,FALSE)","v":{"$error":"#REF!"}},{"$error":"#REF!"},{"$error":"#REF!"}]
[{"$error":"#REF!"},{"$f":"_xlfn.CHISQ.DIST(A389,#REF!,FALSE)","v":{"$error":"#REF!"}},{"$error":"#REF!"},{"$error":"#REF!"}]
[{"$error":"#REF!"},{"$f":"_xlfn.CHISQ.DIST(A390,#REF!,FALSE)","v":{"$error":"#REF!"}},{"$error":"#REF!"},{"$error":"#REF!"}]
[{"$error":"#REF!"},{"$f":"_xlfn.CHISQ.DIST(A391,#REF!,FALSE)","v":{"$error":"#REF!"}},{"$error":"#REF!"},{"$error":"#REF!"}]
[{"$error":"#REF!"},{"$f":"_xlfn.CHISQ.DIST(A392,#REF!,FALSE)","v":{"$error":"#REF!"}},{"$error":"#REF!"},{"$error":"#REF!"}]
[{"$error":"#REF!"},{"$f":"_xlfn.CHISQ.DIST(A393,#REF!,FALSE)","v":{"$error":"#REF!"}},{"$f":"IF($A393<$D$3,IF($A394>$D$3,MAX($B$9:$B$1009),\"\"),\"\")","v":{"$error":"#REF!"}},{"$f":"IF($A393<$D$4,IF($A394>$D$4,MAX($B$9:$B$1009),\"\"),\"\")","v":{"$error":"#REF!"}}]
[{"$f":"+A393+$B$4","v":{"$error":"#REF!"}},{"$f":"_xlfn.CHISQ.DIST(A394,#REF!,FALSE)","v":{"$error":"#REF!"}},{"$error":"#REF!"},{"$error":"#REF!"}]
[{"$error":"#REF!"},{"$f":"_xlfn.CHISQ.DIST(A395,#REF!,FALSE)","v":{"$error":"#REF!"}},{"$error":"#REF!"},{"$error":"#REF!"}]
[{"$error":"#REF!"},{"$f":"_xlfn.CHISQ.DIST(A396,#REF!,FALSE)","v":{"$error":"#REF!"}},{"$error":"#REF!"},{"$error":"#REF!"}]
[{"$error":"#REF!"},{"$f":"_xlfn.CHISQ.DIST(A397,#REF!,FALSE)","v":{"$error":"#REF!"}},{"$error":"#REF!"},{"$error":"#REF!"}]
[{"$error":"#REF!"},{"$f":"_xlfn.CHISQ.DIST(A398,#REF!,FALSE)","v":{"$error":"#REF!"}},{"$error":"#REF!"},{"$error":"#REF!"}]
[{"$error":"#REF!"},{"$f":"_xlfn.CHISQ.DIST(A399,#REF!,FALSE)","v":{"$error":"#REF!"}},{"$error":"#REF!"},{"$error":"#REF!"}]
[{"$error":"#REF!"},{"$f":"_xlfn.CHISQ.DIST(A400,#REF!,FALSE)","v":{"$error":"#REF!"}},{"$error":"#REF!"},{"$error":"#REF!"}]
[{"$error":"#REF!"},{"$f":"_xlfn.CHISQ.DIST(A401,#REF!,FALSE)","v":{"$error":"#REF!"}},{"$error":"#REF!"},{"$error":"#REF!"}]
[{"$error":"#REF!"},{"$f":"_xlfn.CHISQ.DIST(A402,#REF!,FALSE)","v":{"$error":"#REF!"}},{"$error":"#REF!"},{"$error":"#REF!"}]
[{"$error":"#REF!"},{"$f":"_xlfn.CHISQ.DIST(A403,#REF!,FALSE)","v":{"$error":"#REF!"}},{"$error":"#REF!"},{"$error":"#REF!"}]
[{"$error":"#REF!"},{"$f":"_xlfn.CHISQ.DIST(A404,#REF!,FALSE)","v":{"$error":"#REF!"}},{"$error":"#REF!"},{"$error":"#REF!"}]
[{"$error":"#REF!"},{"$f":"_xlfn.CHISQ.DIST(A405,#REF!,FALSE)","v":{"$error":"#REF!"}},{"$error":"#REF!"},{"$error":"#REF!"}]
[{"$error":"#REF!"},{"$f":"_xlfn.CHISQ.DIST(A406,#REF!,FALSE)","v":{"$error":"#REF!"}},{"$error":"#REF!"},{"$error":"#REF!"}]
[{"$error":"#REF!"},{"$f":"_xlfn.CHISQ.DIST(A407,#REF!,FALSE)","v":{"$error":"#REF!"}},{"$error":"#REF!"},{"$error":"#REF!"}]
[{"$error":"#REF!"},{"$f":"_xlfn.CHISQ.DIST(A408,#REF!,FALSE)","v":{"$error":"#REF!"}},{"$error":"#REF!"},{"$error":"#REF!"}]
[{"$error":"#REF!"},{"$f":"_xlfn.CHISQ.DIST(A409,#REF!,FALSE)","v":{"$error":"#REF!"}},{"$error":"#REF!"},{"$error":"#REF!"}]
[{"$error":"#REF!"},{"$f":"_xlfn.CHISQ.DIST(A410,#REF!,FALSE)","v":{"$error":"#REF!"}},{"$error":"#REF!"},{"$error":"#REF!"}]
[{"$error":"#REF!"},{"$f":"_xlfn.CHISQ.DIST(A411,#REF!,FALSE)","v":{"$error":"#REF!"}},{"$error":"#REF!"},{"$error":"#REF!"}]
[{"$error":"#REF!"},{"$f":"_xlfn.CHISQ.DIST(A412,#REF!,FALSE)","v":{"$error":"#REF!"}},{"$error":"#REF!"},{"$error":"#REF!"}]
[{"$error":"#REF!"},{"$f":"_xlfn.CHISQ.DIST(A413,#REF!,FALSE)","v":{"$error":"#REF!"}},{"$error":"#REF!"},{"$error":"#REF!"}]
[{"$error":"#REF!"},{"$f":"_xlfn.CHISQ.DIST(A414,#REF!,FALSE)","v":{"$error":"#REF!"}},{"$error":"#REF!"},{"$error":"#REF!"}]
[{"$error":"#REF!"},{"$f":"_xlfn.CHISQ.DIST(A415,#REF!,FALSE)","v":{"$error":"#REF!"}},{"$error":"#REF!"},{"$error":"#REF!"}]
[{"$error":"#REF!"},{"$f":"_xlfn.CHISQ.DIST(A416,#REF!,FALSE)","v":{"$error":"#REF!"}},{"$error":"#REF!"},{"$error":"#REF!"}]
[{"$error":"#REF!"},{"$f":"_xlfn.CHISQ.DIST(A417,#REF!,FALSE)","v":{"$error":"#REF!"}},{"$error":"#REF!"},{"$error":"#REF!"}]
[{"$error":"#REF!"},{"$f":"_xlfn.CHISQ.DIST(A418,#REF!,FALSE)","v":{"$error":"#REF!"}},{"$error":"#REF!"},{"$error":"#REF!"}]
[{"$error":"#REF!"},{"$f":"_xlfn.CHISQ.DIST(A419,#REF!,FALSE)","v":{"$error":"#REF!"}},{"$error":"#REF!"},{"$error":"#REF!"}]
[{"$error":"#REF!"},{"$f":"_xlfn.CHISQ.DIST(A420,#REF!,FALSE)","v":{"$error":"#REF!"}},{"$error":"#REF!"},{"$error":"#REF!"}]
[{"$error":"#REF!"},{"$f":"_xlfn.CHISQ.DIST(A421,#REF!,FALSE)","v":{"$error":"#REF!"}},{"$error":"#REF!"},{"$error":"#REF!"}]
[{"$error":"#REF!"},{"$f":"_xlfn.CHISQ.DIST(A422,#REF!,FALSE)","v":{"$error":"#REF!"}},{"$error":"#REF!"},{"$error":"#REF!"}]
[{"$error":"#REF!"},{"$f":"_xlfn.CHISQ.DIST(A423,#REF!,FALSE)","v":{"$error":"#REF!"}},{"$error":"#REF!"},{"$error":"#REF!"}]
[{"$error":"#REF!"},{"$f":"_xlfn.CHISQ.DIST(A424,#REF!,FALSE)","v":{"$error":"#REF!"}},{"$error":"#REF!"},{"$error":"#REF!"}]
[{"$error":"#REF!"},{"$f":"_xlfn.CHISQ.DIST(A425,#REF!,FALSE)","v":{"$error":"#REF!"}},{"$error":"#REF!"},{"$error":"#REF!"}]
[{"$error":"#REF!"},{"$f":"_xlfn.CHISQ.DIST(A426,#REF!,FALSE)","v":{"$error":"#REF!"}},{"$error":"#REF!"},{"$error":"#REF!"}]
[{"$error":"#REF!"},{"$f":"_xlfn.CHISQ.DIST(A427,#REF!,FALSE)","v":{"$error":"#REF!"}},{"$error":"#REF!"},{"$error":"#REF!"}]
[{"$error":"#REF!"},{"$f":"_xlfn.CHISQ.DIST(A428,#REF!,FALSE)","v":{"$error":"#REF!"}},{"$error":"#REF!"},{"$error":"#REF!"}]
[{"$error":"#REF!"},{"$f":"_xlfn.CHISQ.DIST(A429,#REF!,FALSE)","v":{"$error":"#REF!"}},{"$error":"#REF!"},{"$error":"#REF!"}]
[{"$error":"#REF!"},{"$f":"_xlfn.CHISQ.DIST(A430,#REF!,FALSE)","v":{"$error":"#REF!"}},{"$error":"#REF!"},{"$error":"#REF!"}]
[{"$error":"#REF!"},{"$f":"_xlfn.CHISQ.DIST(A431,#REF!,FALSE)","v":{"$error":"#REF!"}},{"$error":"#REF!"},{"$error":"#REF!"}]
[{"$error":"#REF!"},{"$f":"_xlfn.CHISQ.DIST(A432,#REF!,FALSE)","v":{"$error":"#REF!"}},{"$error":"#REF!"},{"$error":"#REF!"}]
[{"$error":"#REF!"},{"$f":"_xlfn.CHISQ.DIST(A433,#REF!,FALSE)","v":{"$error":"#REF!"}},{"$error":"#REF!"},{"$error":"#REF!"}]
[{"$error":"#REF!"},{"$f":"_xlfn.CHISQ.DIST(A434,#REF!,FALSE)","v":{"$error":"#REF!"}},{"$error":"#REF!"},{"$error":"#REF!"}]
[{"$error":"#REF!"},{"$f":"_xlfn.CHISQ.DIST(A435,#REF!,FALSE)","v":{"$error":"#REF!"}},{"$error":"#REF!"},{"$error":"#REF!"}]
[{"$error":"#REF!"},{"$f":"_xlfn.CHISQ.DIST(A436,#REF!,FALSE)","v":{"$error":"#REF!"}},{"$error":"#REF!"},{"$error":"#REF!"}]
[{"$error":"#REF!"},{"$f":"_xlfn.CHISQ.DIST(A437,#REF!,FALSE)","v":{"$error":"#REF!"}},{"$error":"#REF!"},{"$error":"#REF!"}]
[{"$error":"#REF!"},{"$f":"_xlfn.CHISQ.DIST(A438,#REF!,FALSE)","v":{"$error":"#REF!"}},{"$error":"#REF!"},{"$error":"#REF!"}]
[{"$error":"#REF!"},{"$f":"_xlfn.CHISQ.DIST(A439,#REF!,FALSE)","v":{"$error":"#REF!"}},{"$error":"#REF!"},{"$error":"#REF!"}]
[{"$error":"#REF!"},{"$f":"_xlfn.CHISQ.DIST(A440,#REF!,FALSE)","v":{"$error":"#REF!"}},{"$error":"#REF!"},{"$error":"#REF!"}]
[{"$error":"#REF!"},{"$f":"_xlfn.CHISQ.DIST(A441,#REF!,FALSE)","v":{"$error":"#REF!"}},{"$error":"#REF!"},{"$error":"#REF!"}]
[{"$error":"#REF!"},{"$f":"_xlfn.CHISQ.DIST(A442,#REF!,FALSE)","v":{"$error":"#REF!"}},{"$error":"#REF!"},{"$error":"#REF!"}]
[{"$error":"#REF!"},{"$f":"_xlfn.CHISQ.DIST(A443,#REF!,FALSE)","v":{"$error":"#REF!"}},{"$error":"#REF!"},{"$error":"#REF!"}]
[{"$error":"#REF!"},{"$f":"_xlfn.CHISQ.DIST(A444,#REF!,FALSE)","v":{"$error":"#REF!"}},{"$error":"#REF!"},{"$error":"#REF!"}]
[{"$error":"#REF!"},{"$f":"_xlfn.CHISQ.DIST(A445,#REF!,FALSE)","v":{"$error":"#REF!"}},{"$error":"#REF!"},{"$error":"#REF!"}]
[{"$error":"#REF!"},{"$f":"_xlfn.CHISQ.DIST(A446,#REF!,FALSE)","v":{"$error":"#REF!"}},{"$error":"#REF!"},{"$error":"#REF!"}]
[{"$error":"#REF!"},{"$f":"_xlfn.CHISQ.DIST(A447,#REF!,FALSE)","v":{"$error":"#REF!"}},{"$error":"#REF!"},{"$error":"#REF!"}]
[{"$error":"#REF!"},{"$f":"_xlfn.CHISQ.DIST(A448,#REF!,FALSE)","v":{"$error":"#REF!"}},{"$error":"#REF!"},{"$error":"#REF!"}]
[{"$error":"#REF!"},{"$f":"_xlfn.CHISQ.DIST(A449,#REF!,FALSE)","v":{"$error":"#REF!"}},{"$error":"#REF!"},{"$error":"#REF!"}]
[{"$error":"#REF!"},{"$f":"_xlfn.CHISQ.DIST(A450,#REF!,FALSE)","v":{"$error":"#REF!"}},{"$error":"#REF!"},{"$error":"#REF!"}]
[{"$error":"#REF!"},{"$f":"_xlfn.CHISQ.DIST(A451,#REF!,FALSE)","v":{"$error":"#REF!"}},{"$error":"#REF!"},{"$error":"#REF!"}]
[{"$error":"#REF!"},{"$f":"_xlfn.CHISQ.DIST(A452,#REF!,FALSE)","v":{"$error":"#REF!"}},{"$error":"#REF!"},{"$error":"#REF!"}]
[{"$error":"#REF!"},{"$f":"_xlfn.CHISQ.DIST(A453,#REF!,FALSE)","v":{"$error":"#REF!"}},{"$error":"#REF!"},{"$error":"#REF!"}]
[{"$error":"#REF!"},{"$f":"_xlfn.CHISQ.DIST(A454,#REF!,FALSE)","v":{"$error":"#REF!"}},{"$error":"#REF!"},{"$error":"#REF!"}]
[{"$error":"#REF!"},{"$f":"_xlfn.CHISQ.DIST(A455,#REF!,FALSE)","v":{"$error":"#REF!"}},{"$error":"#REF!"},{"$error":"#REF!"}]
[{"$error":"#REF!"},{"$f":"_xlfn.CHISQ.DIST(A456,#REF!,FALSE)","v":{"$error":"#REF!"}},{"$error":"#REF!"},{"$error":"#REF!"}]
[{"$error":"#REF!"},{"$f":"_xlfn.CHISQ.DIST(A457,#REF!,FALSE)","v":{"$error":"#REF!"}},{"$f":"IF($A457<$D$3,IF($A458>$D$3,MAX($B$9:$B$1009),\"\"),\"\")","v":{"$error":"#REF!"}},{"$f":"IF($A457<$D$4,IF($A458>$D$4,MAX($B$9:$B$1009),\"\"),\"\")","v":{"$error":"#REF!"}}]
[{"$f":"+A457+$B$4","v":{"$error":"#REF!"}},{"$f":"_xlfn.CHISQ.DIST(A458,#REF!,FALSE)","v":{"$error":"#REF!"}},{"$error":"#REF!"},{"$error":"#REF!"}]
[{"$error":"#REF!"},{"$f":"_xlfn.CHISQ.DIST(A459,#REF!,FALSE)","v":{"$error":"#REF!"}},{"$error":"#REF!"},{"$error":"#REF!"}]
[{"$error":"#REF!"},{"$f":"_xlfn.CHISQ.DIST(A460,#REF!,FALSE)","v":{"$error":"#REF!"}},{"$error":"#REF!"},{"$error":"#REF!"}]
[{"$error":"#REF!"},{"$f":"_xlfn.CHISQ.DIST(A461,#REF!,FALSE)","v":{"$error":"#REF!"}},{"$error":"#REF!"},{"$error":"#REF!"}]
[{"$error":"#REF!"},{"$f":"_xlfn.CHISQ.DIST(A462,#REF!,FALSE)","v":{"$error":"#REF!"}},{"$error":"#REF!"},{"$error":"#REF!"}]
[{"$error":"#REF!"},{"$f":"_xlfn.CHISQ.DIST(A463,#REF!,FALSE)","v":{"$error":"#REF!"}},{"$error":"#REF!"},{"$error":"#REF!"}]
[{"$error":"#REF!"},{"$f":"_xlfn.CHISQ.DIST(A464,#REF!,FALSE)","v":{"$error":"#REF!"}},{"$error":"#REF!"},{"$error":"#REF!"}]
[{"$error":"#REF!"},{"$f":"_xlfn.CHISQ.DIST(A465,#REF!,FALSE)","v":{"$error":"#REF!"}},{"$error":"#REF!"},{"$error":"#REF!"}]
[{"$error":"#REF!"},{"$f":"_xlfn.CHISQ.DIST(A466,#REF!,FALSE)","v":{"$error":"#REF!"}},{"$error":"#REF!"},{"$error":"#REF!"}]
[{"$error":"#REF!"},{"$f":"_xlfn.CHISQ.DIST(A467,#REF!,FALSE)","v":{"$error":"#REF!"}},{"$error":"#REF!"},{"$error":"#REF!"}]
[{"$error":"#REF!"},{"$f":"_xlfn.CHISQ.DIST(A468,#REF!,FALSE)","v":{"$error":"#REF!"}},{"$error":"#REF!"},{"$error":"#REF!"}]
[{"$error":"#REF!"},{"$f":"_xlfn.CHISQ.DIST(A469,#REF!,FALSE)","v":{"$error":"#REF!"}},{"$error":"#REF!"},{"$error":"#REF!"}]
[{"$error":"#REF!"},{"$f":"_xlfn.CHISQ.DIST(A470,#REF!,FALSE)","v":{"$error":"#REF!"}},{"$error":"#REF!"},{"$error":"#REF!"}]
[{"$error":"#REF!"},{"$f":"_xlfn.CHISQ.DIST(A471,#REF!,FALSE)","v":{"$error":"#REF!"}},{"$error":"#REF!"},{"$error":"#REF!"}]
[{"$error":"#REF!"},{"$f":"_xlfn.CHISQ.DIST(A472,#REF!,FALSE)","v":{"$error":"#REF!"}},{"$error":"#REF!"},{"$error":"#REF!"}]
[{"$error":"#REF!"},{"$f":"_xlfn.CHISQ.DIST(A473,#REF!,FALSE)","v":{"$error":"#REF!"}},{"$error":"#REF!"},{"$error":"#REF!"}]
[{"$error":"#REF!"},{"$f":"_xlfn.CHISQ.DIST(A474,#REF!,FALSE)","v":{"$error":"#REF!"}},{"$error":"#REF!"},{"$error":"#REF!"}]
[{"$error":"#REF!"},{"$f":"_xlfn.CHISQ.DIST(A475,#REF!,FALSE)","v":{"$error":"#REF!"}},{"$error":"#REF!"},{"$error":"#REF!"}]
[{"$error":"#REF!"},{"$f":"_xlfn.CHISQ.DIST(A476,#REF!,FALSE)","v":{"$error":"#REF!"}},{"$error":"#REF!"},{"$error":"#REF!"}]
[{"$error":"#REF!"},{"$f":"_xlfn.CHISQ.DIST(A477,#REF!,FALSE)","v":{"$error":"#REF!"}},{"$error":"#REF!"},{"$error":"#REF!"}]
[{"$error":"#REF!"},{"$f":"_xlfn.CHISQ.DIST(A478,#REF!,FALSE)","v":{"$error":"#REF!"}},{"$error":"#REF!"},{"$error":"#REF!"}]
[{"$error":"#REF!"},{"$f":"_xlfn.CHISQ.DIST(A479,#REF!,FALSE)","v":{"$error":"#REF!"}},{"$error":"#REF!"},{"$error":"#REF!"}]
[{"$error":"#REF!"},{"$f":"_xlfn.CHISQ.DIST(A480,#REF!,FALSE)","v":{"$error":"#REF!"}},{"$error":"#REF!"},{"$error":"#REF!"}]
[{"$error":"#REF!"},{"$f":"_xlfn.CHISQ.DIST(A481,#REF!,FALSE)","v":{"$error":"#REF!"}},{"$error":"#REF!"},{"$error":"#REF!"}]
[{"$error":"#REF!"},{"$f":"_xlfn.CHISQ.DIST(A482,#REF!,FALSE)","v":{"$error":"#REF!"}},{"$error":"#REF!"},{"$error":"#REF!"}]
[{"$error":"#REF!"},{"$f":"_xlfn.CHISQ.DIST(A483,#REF!,FALSE)","v":{"$error":"#REF!"}},{"$error":"#REF!"},{"$error":"#REF!"}]
[{"$error":"#REF!"},{"$f":"_xlfn.CHISQ.DIST(A484,#REF!,FALSE)","v":{"$error":"#REF!"}},{"$error":"#REF!"},{"$error":"#REF!"}]
[{"$error":"#REF!"},{"$f":"_xlfn.CHISQ.DIST(A485,#REF!,FALSE)","v":{"$error":"#REF!"}},{"$error":"#REF!"},{"$error":"#REF!"}]
[{"$error":"#REF!"},{"$f":"_xlfn.CHISQ.DIST(A486,#REF!,FALSE)","v":{"$error":"#REF!"}},{"$error":"#REF!"},{"$error":"#REF!"}]
[{"$error":"#REF!"},{"$f":"_xlfn.CHISQ.DIST(A487,#REF!,FALSE)","v":{"$error":"#REF!"}},{"$error":"#REF!"},{"$error":"#REF!"}]
[{"$error":"#REF!"},{"$f":"_xlfn.CHISQ.DIST(A488,#REF!,FALSE)","v":{"$error":"#REF!"}},{"$error":"#REF!"},{"$error":"#REF!"}]
[{"$error":"#REF!"},{"$f":"_xlfn.CHISQ.DIST(A489,#REF!,FALSE)","v":{"$error":"#REF!"}},{"$error":"#REF!"},{"$error":"#REF!"}]
[{"$error":"#REF!"},{"$f":"_xlfn.CHISQ.DIST(A490,#REF!,FALSE)","v":{"$error":"#REF!"}},{"$error":"#REF!"},{"$error":"#REF!"}]
[{"$error":"#REF!"},{"$f":"_xlfn.CHISQ.DIST(A491,#REF!,FALSE)","v":{"$error":"#REF!"}},{"$error":"#REF!"},{"$error":"#REF!"}]
[{"$error":"#REF!"},{"$f":"_xlfn.CHISQ.DIST(A492,#REF!,FALSE)","v":{"$error":"#REF!"}},{"$error":"#REF!"},{"$error":"#REF!"}]
[{"$error":"#REF!"},{"$f":"_xlfn.CHISQ.DIST(A493,#REF!,FALSE)","v":{"$error":"#REF!"}},{"$error":"#REF!"},{"$error":"#REF!"}]
[{"$error":"#REF!"},{"$f":"_xlfn.CHISQ.DIST(A494,#REF!,FALSE)","v":{"$error":"#REF!"}},{"$error":"#REF!"},{"$error":"#REF!"}]
[{"$error":"#REF!"},{"$f":"_xlfn.CHISQ.DIST(A495,#REF!,FALSE)","v":{"$error":"#REF!"}},{"$error":"#REF!"},{"$error":"#REF!"}]
[{"$error":"#REF!"},{"$f":"_xlfn.CHISQ.DIST(A496,#REF!,FALSE)","v":{"$error":"#REF!"}},{"$error":"#REF!"},{"$error":"#REF!"}]
[{"$error":"#REF!"},{"$f":"_xlfn.CHISQ.DIST(A497,#REF!,FALSE)","v":{"$error":"#REF!"}},{"$error":"#REF!"},{"$error":"#REF!"}]
[{"$error":"#REF!"},{"$f":"_xlfn.CHISQ.DIST(A498,#REF!,FALSE)","v":{"$error":"#REF!"}},{"$error":"#REF!"},{"$error":"#REF!"}]
[{"$error":"#REF!"},{"$f":"_xlfn.CHISQ.DIST(A499,#REF!,FALSE)","v":{"$error":"#REF!"}},{"$error":"#REF!"},{"$error":"#REF!"}]
[{"$error":"#REF!"},{"$f":"_xlfn.CHISQ.DIST(A500,#REF!,FALSE)","v":{"$error":"#REF!"}},{"$error":"#REF!"},{"$error":"#REF!"}]
[{"$error":"#REF!"},{"$f":"_xlfn.CHISQ.DIST(A501,#REF!,FALSE)","v":{"$error":"#REF!"}},{"$error":"#REF!"},{"$error":"#REF!"}]
[{"$error":"#REF!"},{"$f":"_xlfn.CHISQ.DIST(A502,#REF!,FALSE)","v":{"$error":"#REF!"}},{"$error":"#REF!"},{"$error":"#REF!"}]
[{"$error":"#REF!"},{"$f":"_xlfn.CHISQ.DIST(A503,#REF!,FALSE)","v":{"$error":"#REF!"}},{"$error":"#REF!"},{"$error":"#REF!"}]
[{"$error":"#REF!"},{"$f":"_xlfn.CHISQ.DIST(A504,#REF!,FALSE)","v":{"$error":"#REF!"}},{"$error":"#REF!"},{"$error":"#REF!"}]
[{"$error":"#REF!"},{"$f":"_xlfn.CHISQ.DIST(A505,#REF!,FALSE)","v":{"$error":"#REF!"}},{"$error":"#REF!"},{"$error":"#REF!"}]
[{"$error":"#REF!"},{"$f":"_xlfn.CHISQ.DIST(A506,#REF!,FALSE)","v":{"$error":"#REF!"}},{"$error":"#REF!"},{"$error":"#REF!"}]
[{"$error":"#REF!"},{"$f":"_xlfn.CHISQ.DIST(A507,#REF!,FALSE)","v":{"$error":"#REF!"}},{"$error":"#REF!"},{"$error":"#REF!"}]
[{"$error":"#REF!"},{"$f":"_xlfn.CHISQ.DIST(A508,#REF!,FALSE)","v":{"$error":"#REF!"}},{"$error":"#REF!"},{"$error":"#REF!"}]
[{"$error":"#REF!"},{"$f":"_xlfn.CHISQ.DIST(A509,#REF!,FALSE)","v":{"$error":"#REF!"}},{"$error":"#REF!"},{"$error":"#REF!"}]
[{"$error":"#REF!"},{"$f":"_xlfn.CHISQ.DIST(A510,#REF!,FALSE)","v":{"$error":"#REF!"}},{"$error":"#REF!"},{"$error":"#REF!"}]
[{"$error":"#REF!"},{"$f":"_xlfn.CHISQ.DIST(A511,#REF!,FALSE)","v":{"$error":"#REF!"}},{"$error":"#REF!"},{"$error":"#REF!"}]
[{"$error":"#REF!"},{"$f":"_xlfn.CHISQ.DIST(A512,#REF!,FALSE)","v":{"$error":"#REF!"}},{"$error":"#REF!"},{"$error":"#REF!"}]
[{"$error":"#REF!"},{"$f":"_xlfn.CHISQ.DIST(A513,#REF!,FALSE)","v":{"$error":"#REF!"}},{"$error":"#REF!"},{"$error":"#REF!"}]
[{"$error":"#REF!"},{"$f":"_xlfn.CHISQ.DIST(A514,#REF!,FALSE)","v":{"$error":"#REF!"}},{"$error":"#REF!"},{"$error":"#REF!"}]
[{"$error":"#REF!"},{"$f":"_xlfn.CHISQ.DIST(A515,#REF!,FALSE)","v":{"$error":"#REF!"}},{"$error":"#REF!"},{"$error":"#REF!"}]
[{"$error":"#REF!"},{"$f":"_xlfn.CHISQ.DIST(A516,#REF!,FALSE)","v":{"$error":"#REF!"}},{"$error":"#REF!"},{"$error":"#REF!"}]
[{"$error":"#REF!"},{"$f":"_xlfn.CHISQ.DIST(A517,#REF!,FALSE)","v":{"$error":"#REF!"}},{"$error":"#REF!"},{"$error":"#REF!"}]
[{"$error":"#REF!"},{"$f":"_xlfn.CHISQ.DIST(A518,#REF!,FALSE)","v":{"$error":"#REF!"}},{"$error":"#REF!"},{"$error":"#REF!"}]
[{"$error":"#REF!"},{"$f":"_xlfn.CHISQ.DIST(A519,#REF!,FALSE)","v":{"$error":"#REF!"}},{"$error":"#REF!"},{"$error":"#REF!"}]
[{"$error":"#REF!"},{"$f":"_xlfn.CHISQ.DIST(A520,#REF!,FALSE)","v":{"$error":"#REF!"}},{"$error":"#REF!"},{"$error":"#REF!"}]
[{"$error":"#REF!"},{"$f":"_xlfn.CHISQ.DIST(A521,#REF!,FALSE)","v":{"$error":"#REF!"}},{"$f":"IF($A521<$D$3,IF($A522>$D$3,MAX($B$9:$B$1009),\"\"),\"\")","v":{"$error":"#REF!"}},{"$f":"IF($A521<$D$4,IF($A522>$D$4,MAX($B$9:$B$1009),\"\"),\"\")","v":{"$error":"#REF!"}}]
[{"$f":"+A521+$B$4","v":{"$error":"#REF!"}},{"$f":"_xlfn.CHISQ.DIST(A522,#REF!,FALSE)","v":{"$error":"#REF!"}},{"$error":"#REF!"},{"$error":"#REF!"}]
[{"$error":"#REF!"},{"$f":"_xlfn.CHISQ.DIST(A523,#REF!,FALSE)","v":{"$error":"#REF!"}},{"$error":"#REF!"},{"$error":"#REF!"}]
[{"$error":"#REF!"},{"$f":"_xlfn.CHISQ.DIST(A524,#REF!,FALSE)","v":{"$error":"#REF!"}},{"$error":"#REF!"},{"$error":"#REF!"}]
[{"$error":"#REF!"},{"$f":"_xlfn.CHISQ.DIST(A525,#REF!,FALSE)","v":{"$error":"#REF!"}},{"$error":"#REF!"},{"$error":"#REF!"}]
[{"$error":"#REF!"},{"$f":"_xlfn.CHISQ.DIST(A526,#REF!,FALSE)","v":{"$error":"#REF!"}},{"$error":"#REF!"},{"$error":"#REF!"}]
[{"$error":"#REF!"},{"$f":"_xlfn.CHISQ.DIST(A527,#REF!,FALSE)","v":{"$error":"#REF!"}},{"$error":"#REF!"},{"$error":"#REF!"}]
[{"$error":"#REF!"},{"$f":"_xlfn.CHISQ.DIST(A528,#REF!,FALSE)","v":{"$error":"#REF!"}},{"$error":"#REF!"},{"$error":"#REF!"}]
[{"$error":"#REF!"},{"$f":"_xlfn.CHISQ.DIST(A529,#REF!,FALSE)","v":{"$error":"#REF!"}},{"$error":"#REF!"},{"$error":"#REF!"}]
[{"$error":"#REF!"},{"$f":"_xlfn.CHISQ.DIST(A530,#REF!,FALSE)","v":{"$error":"#REF!"}},{"$error":"#REF!"},{"$error":"#REF!"}]
[{"$error":"#REF!"},{"$f":"_xlfn.CHISQ.DIST(A531,#REF!,FALSE)","v":{"$error":"#REF!"}},{"$error":"#REF!"},{"$error":"#REF!"}]
[{"$error":"#REF!"},{"$f":"_xlfn.CHISQ.DIST(A532,#REF!,FALSE)","v":{"$error":"#REF!"}},{"$error":"#REF!"},{"$error":"#REF!"}]
[{"$error":"#REF!"},{"$f":"_xlfn.CHISQ.DIST(A533,#REF!,FALSE)","v":{"$error":"#REF!"}},{"$error":"#REF!"},{"$error":"#REF!"}]
[{"$error":"#REF!"},{"$f":"_xlfn.CHISQ.DIST(A534,#REF!,FALSE)","v":{"$error":"#REF!"}},{"$error":"#REF!"},{"$error":"#REF!"}]
[{"$error":"#REF!"},{"$f":"_xlfn.CHISQ.DIST(A535,#REF!,FALSE)","v":{"$error":"#REF!"}},{"$error":"#REF!"},{"$error":"#REF!"}]
[{"$error":"#REF!"},{"$f":"_xlfn.CHISQ.DIST(A536,#REF!,FALSE)","v":{"$error":"#REF!"}},{"$error":"#REF!"},{"$error":"#REF!"}]
[{"$error":"#REF!"},{"$f":"_xlfn.CHISQ.DIST(A537,#REF!,FALSE)","v":{"$error":"#REF!"}},{"$error":"#REF!"},{"$error":"#REF!"}]
[{"$error":"#REF!"},{"$f":"_xlfn.CHISQ.DIST(A538,#REF!,FALSE)","v":{"$error":"#REF!"}},{"$error":"#REF!"},{"$error":"#REF!"}]
[{"$error":"#REF!"},{"$f":"_xlfn.CHISQ.DIST(A539,#REF!,FALSE)","v":{"$error":"#REF!"}},{"$error":"#REF!"},{"$error":"#REF!"}]
[{"$error":"#REF!"},{"$f":"_xlfn.CHISQ.DIST(A540,#REF!,FALSE)","v":{"$error":"#REF!"}},{"$error":"#REF!"},{"$error":"#REF!"}]
[{"$error":"#REF!"},{"$f":"_xlfn.CHISQ.DIST(A541,#REF!,FALSE)","v":{"$error":"#REF!"}},{"$error":"#REF!"},{"$error":"#REF!"}]
[{"$error":"#REF!"},{"$f":"_xlfn.CHISQ.DIST(A542,#REF!,FALSE)","v":{"$error":"#REF!"}},{"$error":"#REF!"},{"$error":"#REF!"}]
[{"$error":"#REF!"},{"$f":"_xlfn.CHISQ.DIST(A543,#REF!,FALSE)","v":{"$error":"#REF!"}},{"$error":"#REF!"},{"$error":"#REF!"}]
[{"$error":"#REF!"},{"$f":"_xlfn.CHISQ.DIST(A544,#REF!,FALSE)","v":{"$error":"#REF!"}},{"$error":"#REF!"},{"$error":"#REF!"}]
[{"$error":"#REF!"},{"$f":"_xlfn.CHISQ.DIST(A545,#REF!,FALSE)","v":{"$error":"#REF!"}},{"$error":"#REF!"},{"$error":"#REF!"}]
[{"$error":"#REF!"},{"$f":"_xlfn.CHISQ.DIST(A546,#REF!,FALSE)","v":{"$error":"#REF!"}},{"$error":"#REF!"},{"$error":"#REF!"}]
[{"$error":"#REF!"},{"$f":"_xlfn.CHISQ.DIST(A547,#REF!,FALSE)","v":{"$error":"#REF!"}},{"$error":"#REF!"},{"$error":"#REF!"}]
[{"$error":"#REF!"},{"$f":"_xlfn.CHISQ.DIST(A548,#REF!,FALSE)","v":{"$error":"#REF!"}},{"$error":"#REF!"},{"$error":"#REF!"}]
[{"$error":"#REF!"},{"$f":"_xlfn.CHISQ.DIST(A549,#REF!,FALSE)","v":{"$error":"#REF!"}},{"$error":"#REF!"},{"$error":"#REF!"}]
[{"$error":"#REF!"},{"$f":"_xlfn.CHISQ.DIST(A550,#REF!,FALSE)","v":{"$error":"#REF!"}},{"$error":"#REF!"},{"$error":"#REF!"}]
[{"$error":"#REF!"},{"$f":"_xlfn.CHISQ.DIST(A551,#REF!,FALSE)","v":{"$error":"#REF!"}},{"$error":"#REF!"},{"$error":"#REF!"}]
[{"$error":"#REF!"},{"$f":"_xlfn.CHISQ.DIST(A552,#REF!,FALSE)","v":{"$error":"#REF!"}},{"$error":"#REF!"},{"$error":"#REF!"}]
[{"$error":"#REF!"},{"$f":"_xlfn.CHISQ.DIST(A553,#REF!,FALSE)","v":{"$error":"#REF!"}},{"$error":"#REF!"},{"$error":"#REF!"}]
[{"$error":"#REF!"},{"$f":"_xlfn.CHISQ.DIST(A554,#REF!,FALSE)","v":{"$error":"#REF!"}},{"$error":"#REF!"},{"$error":"#REF!"}]
[{"$error":"#REF!"},{"$f":"_xlfn.CHISQ.DIST(A555,#REF!,FALSE)","v":{"$error":"#REF!"}},{"$error":"#REF!"},{"$error":"#REF!"}]
[{"$error":"#REF!"},{"$f":"_xlfn.CHISQ.DIST(A556,#REF!,FALSE)","v":{"$error":"#REF!"}},{"$error":"#REF!"},{"$error":"#REF!"}]
[{"$error":"#REF!"},{"$f":"_xlfn.CHISQ.DIST(A557,#REF!,FALSE)","v":{"$error":"#REF!"}},{"$error":"#REF!"},{"$error":"#REF!"}]
[{"$error":"#REF!"},{"$f":"_xlfn.CHISQ.DIST(A558,#REF!,FALSE)","v":{"$error":"#REF!"}},{"$error":"#REF!"},{"$error":"#REF!"}]
[{"$error":"#REF!"},{"$f":"_xlfn.CHISQ.DIST(A559,#REF!,FALSE)","v":{"$error":"#REF!"}},{"$error":"#REF!"},{"$error":"#REF!"}]
[{"$error":"#REF!"},{"$f":"_xlfn.CHISQ.DIST(A560,#REF!,FALSE)","v":{"$error":"#REF!"}},{"$error":"#REF!"},{"$error":"#REF!"}]
[{"$error":"#REF!"},{"$f":"_xlfn.CHISQ.DIST(A561,#REF!,FALSE)","v":{"$error":"#REF!"}},{"$error":"#REF!"},{"$error":"#REF!"}]
[{"$error":"#REF!"},{"$f":"_xlfn.CHISQ.DIST(A562,#REF!,FALSE)","v":{"$error":"#REF!"}},{"$error":"#REF!"},{"$error":"#REF!"}]
[{"$error":"#REF!"},{"$f":"_xlfn.CHISQ.DIST(A563,#REF!,FALSE)","v":{"$error":"#REF!"}},{"$error":"#REF!"},{"$error":"#REF!"}]
[{"$error":"#REF!"},{"$f":"_xlfn.CHISQ.DIST(A564,#REF!,FALSE)","v":{"$error":"#REF!"}},{"$error":"#REF!"},{"$error":"#REF!"}]
[{"$error":"#REF!"},{"$f":"_xlfn.CHISQ.DIST(A565,#REF!,FALSE)","v":{"$error":"#REF!"}},{"$error":"#REF!"},{"$error":"#REF!"}]
[{"$error":"#REF!"},{"$f":"_xlfn.CHISQ.DIST(A566,#REF!,FALSE)","v":{"$error":"#REF!"}},{"$error":"#REF!"},{"$error":"#REF!"}]
[{"$error":"#REF!"},{"$f":"_xlfn.CHISQ.DIST(A567,#REF!,FALSE)","v":{"$error":"#REF!"}},{"$error":"#REF!"},{"$error":"#REF!"}]
[{"$error":"#REF!"},{"$f":"_xlfn.CHISQ.DIST(A568,#REF!,FALSE)","v":{"$error":"#REF!"}},{"$error":"#REF!"},{"$error":"#REF!"}]
[{"$error":"#REF!"},{"$f":"_xlfn.CHISQ.DIST(A569,#REF!,FALSE)","v":{"$error":"#REF!"}},{"$error":"#REF!"},{"$error":"#REF!"}]
[{"$error":"#REF!"},{"$f":"_xlfn.CHISQ.DIST(A570,#REF!,FALSE)","v":{"$error":"#REF!"}},{"$error":"#REF!"},{"$error":"#REF!"}]
[{"$error":"#REF!"},{"$f":"_xlfn.CHISQ.DIST(A571,#REF!,FALSE)","v":{"$error":"#REF!"}},{"$error":"#REF!"},{"$error":"#REF!"}]
[{"$error":"#REF!"},{"$f":"_xlfn.CHISQ.DIST(A572,#REF!,FALSE)","v":{"$error":"#REF!"}},{"$error":"#REF!"},{"$error":"#REF!"}]
[{"$error":"#REF!"},{"$f":"_xlfn.CHISQ.DIST(A573,#REF!,FALSE)","v":{"$error":"#REF!"}},{"$error":"#REF!"},{"$error":"#REF!"}]
[{"$error":"#REF!"},{"$f":"_xlfn.CHISQ.DIST(A574,#REF!,FALSE)","v":{"$error":"#REF!"}},{"$error":"#REF!"},{"$error":"#REF!"}]
[{"$error":"#REF!"},{"$f":"_xlfn.CHISQ.DIST(A575,#REF!,FALSE)","v":{"$error":"#REF!"}},{"$error":"#REF!"},{"$error":"#REF!"}]
[{"$error":"#REF!"},{"$f":"_xlfn.CHISQ.DIST(A576,#REF!,FALSE)","v":{"$error":"#REF!"}},{"$error":"#REF!"},{"$error":"#REF!"}]
[{"$error":"#REF!"},{"$f":"_xlfn.CHISQ.DIST(A577,#REF!,FALSE)","v":{"$error":"#REF!"}},{"$error":"#REF!"},{"$error":"#REF!"}]
[{"$error":"#REF!"},{"$f":"_xlfn.CHISQ.DIST(A578,#REF!,FALSE)","v":{"$error":"#REF!"}},{"$error":"#REF!"},{"$error":"#REF!"}]
[{"$error":"#REF!"},{"$f":"_xlfn.CHISQ.DIST(A579,#REF!,FALSE)","v":{"$error":"#REF!"}},{"$error":"#REF!"},{"$error":"#REF!"}]
[{"$error":"#REF!"},{"$f":"_xlfn.CHISQ.DIST(A580,#REF!,FALSE)","v":{"$error":"#REF!"}},{"$error":"#REF!"},{"$error":"#REF!"}]
[{"$error":"#REF!"},{"$f":"_xlfn.CHISQ.DIST(A581,#REF!,FALSE)","v":{"$error":"#REF!"}},{"$error":"#REF!"},{"$error":"#REF!"}]
[{"$error":"#REF!"},{"$f":"_xlfn.CHISQ.DIST(A582,#REF!,FALSE)","v":{"$error":"#REF!"}},{"$error":"#REF!"},{"$error":"#REF!"}]
[{"$error":"#REF!"},{"$f":"_xlfn.CHISQ.DIST(A583,#REF!,FALSE)","v":{"$error":"#REF!"}},{"$error":"#REF!"},{"$error":"#REF!"}]
[{"$error":"#REF!"},{"$f":"_xlfn.CHISQ.DIST(A584,#REF!,FALSE)","v":{"$error":"#REF!"}},{"$error":"#REF!"},{"$error":"#REF!"}]
[{"$error":"#REF!"},{"$f":"_xlfn.CHISQ.DIST(A585,#REF!,FALSE)","v":{"$error":"#REF!"}},{"$f":"IF($A585<$D$3,IF($A586>$D$3,MAX($B$9:$B$1009),\"\"),\"\")","v":{"$error":"#REF!"}},{"$f":"IF($A585<$D$4,IF($A586>$D$4,MAX($B$9:$B$1009),\"\"),\"\")","v":{"$error":"#REF!"}}]
[{"$f":"+A585+$B$4","v":{"$error":"#REF!"}},{"$f":"_xlfn.CHISQ.DIST(A586,#REF!,FALSE)","v":{"$error":"#REF!"}},{"$error":"#REF!"},{"$error":"#REF!"}]
[{"$error":"#REF!"},{"$f":"_xlfn.CHISQ.DIST(A587,#REF!,FALSE)","v":{"$error":"#REF!"}},{"$error":"#REF!"},{"$error":"#REF!"}]
[{"$error":"#REF!"},{"$f":"_xlfn.CHISQ.DIST(A588,#REF!,FALSE)","v":{"$error":"#REF!"}},{"$error":"#REF!"},{"$error":"#REF!"}]
[{"$error":"#REF!"},{"$f":"_xlfn.CHISQ.DIST(A589,#REF!,FALSE)","v":{"$error":"#REF!"}},{"$error":"#REF!"},{"$error":"#REF!"}]
[{"$error":"#REF!"},{"$f":"_xlfn.CHISQ.DIST(A590,#REF!,FALSE)","v":{"$error":"#REF!"}},{"$error":"#REF!"},{"$error":"#REF!"}]
[{"$error":"#REF!"},{"$f":"_xlfn.CHISQ.DIST(A591,#REF!,FALSE)","v":{"$error":"#REF!"}},{"$error":"#REF!"},{"$error":"#REF!"}]
[{"$error":"#REF!"},{"$f":"_xlfn.CHISQ.DIST(A592,#REF!,FALSE)","v":{"$error":"#REF!"}},{"$error":"#REF!"},{"$error":"#REF!"}]
[{"$error":"#REF!"},{"$f":"_xlfn.CHISQ.DIST(A593,#REF!,FALSE)","v":{"$error":"#REF!"}},{"$error":"#REF!"},{"$error":"#REF!"}]
[{"$error":"#REF!"},{"$f":"_xlfn.CHISQ.DIST(A594,#REF!,FALSE)","v":{"$error":"#REF!"}},{"$error":"#REF!"},{"$error":"#REF!"}]
[{"$error":"#REF!"},{"$f":"_xlfn.CHISQ.DIST(A595,#REF!,FALSE)","v":{"$error":"#REF!"}},{"$error":"#REF!"},{"$error":"#REF!"}]
[{"$error":"#REF!"},{"$f":"_xlfn.CHISQ.DIST(A596,#REF!,FALSE)","v":{"$error":"#REF!"}},{"$error":"#REF!"},{"$error":"#REF!"}]
[{"$error":"#REF!"},{"$f":"_xlfn.CHISQ.DIST(A597,#REF!,FALSE)","v":{"$error":"#REF!"}},{"$error":"#REF!"},{"$error":"#REF!"}]
[{"$error":"#REF!"},{"$f":"_xlfn.CHISQ.DIST(A598,#REF!,FALSE)","v":{"$error":"#REF!"}},{"$error":"#REF!"},{"$error":"#REF!"}]
[{"$error":"#REF!"},{"$f":"_xlfn.CHISQ.DIST(A599,#REF!,FALSE)","v":{"$error":"#REF!"}},{"$error":"#REF!"},{"$error":"#REF!"}]
[{"$error":"#REF!"},{"$f":"_xlfn.CHISQ.DIST(A600,#REF!,FALSE)","v":{"$error":"#REF!"}},{"$error":"#REF!"},{"$error":"#REF!"}]
[{"$error":"#REF!"},{"$f":"_xlfn.CHISQ.DIST(A601,#REF!,FALSE)","v":{"$error":"#REF!"}},{"$error":"#REF!"},{"$error":"#REF!"}]
[{"$error":"#REF!"},{"$f":"_xlfn.CHISQ.DIST(A602,#REF!,FALSE)","v":{"$error":"#REF!"}},{"$error":"#REF!"},{"$error":"#REF!"}]
[{"$error":"#REF!"},{"$f":"_xlfn.CHISQ.DIST(A603,#REF!,FALSE)","v":{"$error":"#REF!"}},{"$error":"#REF!"},{"$error":"#REF!"}]
[{"$error":"#REF!"},{"$f":"_xlfn.CHISQ.DIST(A604,#REF!,FALSE)","v":{"$error":"#REF!"}},{"$error":"#REF!"},{"$error":"#REF!"}]
[{"$error":"#REF!"},{"$f":"_xlfn.CHISQ.DIST(A605,#REF!,FALSE)","v":{"$error":"#REF!"}},{"$error":"#REF!"},{"$error":"#REF!"}]
[{"$error":"#REF!"},{"$f":"_xlfn.CHISQ.DIST(A606,#REF!,FALSE)","v":{"$error":"#REF!"}},{"$error":"#REF!"},{"$error":"#REF!"}]
[{"$error":"#REF!"},{"$f":"_xlfn.CHISQ.DIST(A607,#REF!,FALSE)","v":{"$error":"#REF!"}},{"$error":"#REF!"},{"$error":"#REF!"}]
[{"$error":"#REF!"},{"$f":"_xlfn.CHISQ.DIST(A608,#REF!,FALSE)","v":{"$error":"#REF!"}},{"$error":"#REF!"},{"$error":"#REF!"}]
[{"$error":"#REF!"},{"$f":"_xlfn.CHISQ.DIST(A609,#REF!,FALSE)","v":{"$error":"#REF!"}},{"$error":"#REF!"},{"$error":"#REF!"}]
[{"$error":"#REF!"},{"$f":"_xlfn.CHISQ.DIST(A610,#REF!,FALSE)","v":{"$error":"#REF!"}},{"$error":"#REF!"},{"$error":"#REF!"}]
[{"$error":"#REF!"},{"$f":"_xlfn.CHISQ.DIST(A611,#REF!,FALSE)","v":{"$error":"#REF!"}},{"$error":"#REF!"},{"$error":"#REF!"}]
[{"$error":"#REF!"},{"$f":"_xlfn.CHISQ.DIST(A612,#REF!,FALSE)","v":{"$error":"#REF!"}},{"$error":"#REF!"},{"$error":"#REF!"}]
[{"$error":"#REF!"},{"$f":"_xlfn.CHISQ.DIST(A613,#REF!,FALSE)","v":{"$error":"#REF!"}},{"$error":"#REF!"},{"$error":"#REF!"}]
[{"$error":"#REF!"},{"$f":"_xlfn.CHISQ.DIST(A614,#REF!,FALSE)","v":{"$error":"#REF!"}},{"$error":"#REF!"},{"$error":"#REF!"}]
[{"$error":"#REF!"},{"$f":"_xlfn.CHISQ.DIST(A615,#REF!,FALSE)","v":{"$error":"#REF!"}},{"$error":"#REF!"},{"$error":"#REF!"}]
[{"$error":"#REF!"},{"$f":"_xlfn.CHISQ.DIST(A616,#REF!,FALSE)","v":{"$error":"#REF!"}},{"$error":"#REF!"},{"$error":"#REF!"}]
[{"$error":"#REF!"},{"$f":"_xlfn.CHISQ.DIST(A617,#REF!,FALSE)","v":{"$error":"#REF!"}},{"$error":"#REF!"},{"$error":"#REF!"}]
[{"$error":"#REF!"},{"$f":"_xlfn.CHISQ.DIST(A618,#REF!,FALSE)","v":{"$error":"#REF!"}},{"$error":"#REF!"},{"$error":"#REF!"}]
[{"$error":"#REF!"},{"$f":"_xlfn.CHISQ.DIST(A619,#REF!,FALSE)","v":{"$error":"#REF!"}},{"$error":"#REF!"},{"$error":"#REF!"}]
[{"$error":"#REF!"},{"$f":"_xlfn.CHISQ.DIST(A620,#REF!,FALSE)","v":{"$error":"#REF!"}},{"$error":"#REF!"},{"$error":"#REF!"}]
[{"$error":"#REF!"},{"$f":"_xlfn.CHISQ.DIST(A621,#REF!,FALSE)","v":{"$error":"#REF!"}},{"$error":"#REF!"},{"$error":"#REF!"}]
[{"$error":"#REF!"},{"$f":"_xlfn.CHISQ.DIST(A622,#REF!,FALSE)","v":{"$error":"#REF!"}},{"$error":"#REF!"},{"$error":"#REF!"}]
[{"$error":"#REF!"},{"$f":"_xlfn.CHISQ.DIST(A623,#REF!,FALSE)","v":{"$error":"#REF!"}},{"$error":"#REF!"},{"$error":"#REF!"}]
[{"$error":"#REF!"},{"$f":"_xlfn.CHISQ.DIST(A624,#REF!,FALSE)","v":{"$error":"#REF!"}},{"$error":"#REF!"},{"$error":"#REF!"}]
[{"$error":"#REF!"},{"$f":"_xlfn.CHISQ.DIST(A625,#REF!,FALSE)","v":{"$error":"#REF!"}},{"$error":"#REF!"},{"$error":"#REF!"}]
[{"$error":"#REF!"},{"$f":"_xlfn.CHISQ.DIST(A626,#REF!,FALSE)","v":{"$error":"#REF!"}},{"$error":"#REF!"},{"$error":"#REF!"}]
[{"$error":"#REF!"},{"$f":"_xlfn.CHISQ.DIST(A627,#REF!,FALSE)","v":{"$error":"#REF!"}},{"$error":"#REF!"},{"$error":"#REF!"}]
[{"$error":"#REF!"},{"$f":"_xlfn.CHISQ.DIST(A628,#REF!,FALSE)","v":{"$error":"#REF!"}},{"$error":"#REF!"},{"$error":"#REF!"}]
[{"$error":"#REF!"},{"$f":"_xlfn.CHISQ.DIST(A629,#REF!,FALSE)","v":{"$error":"#REF!"}},{"$error":"#REF!"},{"$error":"#REF!"}]
[{"$error":"#REF!"},{"$f":"_xlfn.CHISQ.DIST(A630,#REF!,FALSE)","v":{"$error":"#REF!"}},{"$error":"#REF!"},{"$error":"#REF!"}]
[{"$error":"#REF!"},{"$f":"_xlfn.CHISQ.DIST(A631,#REF!,FALSE)","v":{"$error":"#REF!"}},{"$error":"#REF!"},{"$error":"#REF!"}]
[{"$error":"#REF!"},{"$f":"_xlfn.CHISQ.DIST(A632,#REF!,FALSE)","v":{"$error":"#REF!"}},{"$error":"#REF!"},{"$error":"#REF!"}]
[{"$error":"#REF!"},{"$f":"_xlfn.CHISQ.DIST(A633,#REF!,FALSE)","v":{"$error":"#REF!"}},{"$error":"#REF!"},{"$error":"#REF!"}]
[{"$error":"#REF!"},{"$f":"_xlfn.CHISQ.DIST(A634,#REF!,FALSE)","v":{"$error":"#REF!"}},{"$error":"#REF!"},{"$error":"#REF!"}]
[{"$error":"#REF!"},{"$f":"_xlfn.CHISQ.DIST(A635,#REF!,FALSE)","v":{"$error":"#REF!"}},{"$error":"#REF!"},{"$error":"#REF!"}]
[{"$error":"#REF!"},{"$f":"_xlfn.CHISQ.DIST(A636,#REF!,FALSE)","v":{"$error":"#REF!"}},{"$error":"#REF!"},{"$error":"#REF!"}]
[{"$error":"#REF!"},{"$f":"_xlfn.CHISQ.DIST(A637,#REF!,FALSE)","v":{"$error":"#REF!"}},{"$error":"#REF!"},{"$error":"#REF!"}]
[{"$error":"#REF!"},{"$f":"_xlfn.CHISQ.DIST(A638,#REF!,FALSE)","v":{"$error":"#REF!"}},{"$error":"#REF!"},{"$error":"#REF!"}]
[{"$error":"#REF!"},{"$f":"_xlfn.CHISQ.DIST(A639,#REF!,FALSE)","v":{"$error":"#REF!"}},{"$error":"#REF!"},{"$error":"#REF!"}]
[{"$error":"#REF!"},{"$f":"_xlfn.CHISQ.DIST(A640,#REF!,FALSE)","v":{"$error":"#REF!"}},{"$error":"#REF!"},{"$error":"#REF!"}]
[{"$error":"#REF!"},{"$f":"_xlfn.CHISQ.DIST(A641,#REF!,FALSE)","v":{"$error":"#REF!"}},{"$error":"#REF!"},{"$error":"#REF!"}]
[{"$error":"#REF!"},{"$f":"_xlfn.CHISQ.DIST(A642,#REF!,FALSE)","v":{"$error":"#REF!"}},{"$error":"#REF!"},{"$error":"#REF!"}]
[{"$error":"#REF!"},{"$f":"_xlfn.CHISQ.DIST(A643,#REF!,FALSE)","v":{"$error":"#REF!"}},{"$error":"#REF!"},{"$error":"#REF!"}]
[{"$error":"#REF!"},{"$f":"_xlfn.CHISQ.DIST(A644,#REF!,FALSE)","v":{"$error":"#REF!"}},{"$error":"#REF!"},{"$error":"#REF!"}]
[{"$error":"#REF!"},{"$f":"_xlfn.CHISQ.DIST(A645,#REF!,FALSE)","v":{"$error":"#REF!"}},{"$error":"#REF!"},{"$error":"#REF!"}]
[{"$error":"#REF!"},{"$f":"_xlfn.CHISQ.DIST(A646,#REF!,FALSE)","v":{"$error":"#REF!"}},{"$error":"#REF!"},{"$error":"#REF!"}]
[{"$error":"#REF!"},{"$f":"_xlfn.CHISQ.DIST(A647,#REF!,FALSE)","v":{"$error":"#REF!"}},{"$error":"#REF!"},{"$error":"#REF!"}]
[{"$error":"#REF!"},{"$f":"_xlfn.CHISQ.DIST(A648,#REF!,FALSE)","v":{"$error":"#REF!"}},{"$error":"#REF!"},{"$error":"#REF!"}]
[{"$error":"#REF!"},{"$f":"_xlfn.CHISQ.DIST(A649,#REF!,FALSE)","v":{"$error":"#REF!"}},{"$f":"IF($A649<$D$3,IF($A650>$D$3,MAX($B$9:$B$1009),\"\"),\"\")","v":{"$error":"#REF!"}},{"$f":"IF($A649<$D$4,IF($A650>$D$4,MAX($B$9:$B$1009),\"\"),\"\")","v":{"$error":"#REF!"}}]
[{"$f":"+A649+$B$4","v":{"$error":"#REF!"}},{"$f":"_xlfn.CHISQ.DIST(A650,#REF!,FALSE)","v":{"$error":"#REF!"}},{"$error":"#REF!"},{"$error":"#REF!"}]
[{"$error":"#REF!"},{"$f":"_xlfn.CHISQ.DIST(A651,#REF!,FALSE)","v":{"$error":"#REF!"}},{"$error":"#REF!"},{"$error":"#REF!"}]
[{"$error":"#REF!"},{"$f":"_xlfn.CHISQ.DIST(A652,#REF!,FALSE)","v":{"$error":"#REF!"}},{"$error":"#REF!"},{"$error":"#REF!"}]
[{"$error":"#REF!"},{"$f":"_xlfn.CHISQ.DIST(A653,#REF!,FALSE)","v":{"$error":"#REF!"}},{"$error":"#REF!"},{"$error":"#REF!"}]
[{"$error":"#REF!"},{"$f":"_xlfn.CHISQ.DIST(A654,#REF!,FALSE)","v":{"$error":"#REF!"}},{"$error":"#REF!"},{"$error":"#REF!"}]
[{"$error":"#REF!"},{"$f":"_xlfn.CHISQ.DIST(A655,#REF!,FALSE)","v":{"$error":"#REF!"}},{"$error":"#REF!"},{"$error":"#REF!"}]
[{"$error":"#REF!"},{"$f":"_xlfn.CHISQ.DIST(A656,#REF!,FALSE)","v":{"$error":"#REF!"}},{"$error":"#REF!"},{"$error":"#REF!"}]
[{"$error":"#REF!"},{"$f":"_xlfn.CHISQ.DIST(A657,#REF!,FALSE)","v":{"$error":"#REF!"}},{"$error":"#REF!"},{"$error":"#REF!"}]
[{"$error":"#REF!"},{"$f":"_xlfn.CHISQ.DIST(A658,#REF!,FALSE)","v":{"$error":"#REF!"}},{"$error":"#REF!"},{"$error":"#REF!"}]
[{"$error":"#REF!"},{"$f":"_xlfn.CHISQ.DIST(A659,#REF!,FALSE)","v":{"$error":"#REF!"}},{"$error":"#REF!"},{"$error":"#REF!"}]
[{"$error":"#REF!"},{"$f":"_xlfn.CHISQ.DIST(A660,#REF!,FALSE)","v":{"$error":"#REF!"}},{"$error":"#REF!"},{"$error":"#REF!"}]
[{"$error":"#REF!"},{"$f":"_xlfn.CHISQ.DIST(A661,#REF!,FALSE)","v":{"$error":"#REF!"}},{"$error":"#REF!"},{"$error":"#REF!"}]
[{"$error":"#REF!"},{"$f":"_xlfn.CHISQ.DIST(A662,#REF!,FALSE)","v":{"$error":"#REF!"}},{"$error":"#REF!"},{"$error":"#REF!"}]
[{"$error":"#REF!"},{"$f":"_xlfn.CHISQ.DIST(A663,#REF!,FALSE)","v":{"$error":"#REF!"}},{"$error":"#REF!"},{"$error":"#REF!"}]
[{"$error":"#REF!"},{"$f":"_xlfn.CHISQ.DIST(A664,#REF!,FALSE)","v":{"$error":"#REF!"}},{"$error":"#REF!"},{"$error":"#REF!"}]
[{"$error":"#REF!"},{"$f":"_xlfn.CHISQ.DIST(A665,#REF!,FALSE)","v":{"$error":"#REF!"}},{"$error":"#REF!"},{"$error":"#REF!"}]
[{"$error":"#REF!"},{"$f":"_xlfn.CHISQ.DIST(A666,#REF!,FALSE)","v":{"$error":"#REF!"}},{"$error":"#REF!"},{"$error":"#REF!"}]
[{"$error":"#REF!"},{"$f":"_xlfn.CHISQ.DIST(A667,#REF!,FALSE)","v":{"$error":"#REF!"}},{"$error":"#REF!"},{"$error":"#REF!"}]
[{"$error":"#REF!"},{"$f":"_xlfn.CHISQ.DIST(A668,#REF!,FALSE)","v":{"$error":"#REF!"}},{"$error":"#REF!"},{"$error":"#REF!"}]
[{"$error":"#REF!"},{"$f":"_xlfn.CHISQ.DIST(A669,#REF!,FALSE)","v":{"$error":"#REF!"}},{"$error":"#REF!"},{"$error":"#REF!"}]
[{"$error":"#REF!"},{"$f":"_xlfn.CHISQ.DIST(A670,#REF!,FALSE)","v":{"$error":"#REF!"}},{"$error":"#REF!"},{"$error":"#REF!"}]
[{"$error":"#REF!"},{"$f":"_xlfn.CHISQ.DIST(A671,#REF!,FALSE)","v":{"$error":"#REF!"}},{"$error":"#REF!"},{"$error":"#REF!"}]
[{"$error":"#REF!"},{"$f":"_xlfn.CHISQ.DIST(A672,#REF!,FALSE)","v":{"$error":"#REF!"}},{"$error":"#REF!"},{"$error":"#REF!"}]
[{"$error":"#REF!"},{"$f":"_xlfn.CHISQ.DIST(A673,#REF!,FALSE)","v":{"$error":"#REF!"}},{"$error":"#REF!"},{"$error":"#REF!"}]
[{"$error":"#REF!"},{"$f":"_xlfn.CHISQ.DIST(A674,#REF!,FALSE)","v":{"$error":"#REF!"}},{"$error":"#REF!"},{"$error":"#REF!"}]
[{"$error":"#REF!"},{"$f":"_xlfn.CHISQ.DIST(A675,#REF!,FALSE)","v":{"$error":"#REF!"}},{"$error":"#REF!"},{"$error":"#REF!"}]
[{"$error":"#REF!"},{"$f":"_xlfn.CHISQ.DIST(A676,#REF!,FALSE)","v":{"$error":"#REF!"}},{"$error":"#REF!"},{"$error":"#REF!"}]
[{"$error":"#REF!"},{"$f":"_xlfn.CHISQ.DIST(A677,#REF!,FALSE)","v":{"$error":"#REF!"}},{"$error":"#REF!"},{"$error":"#REF!"}]
[{"$error":"#REF!"},{"$f":"_xlfn.CHISQ.DIST(A678,#REF!,FALSE)","v":{"$error":"#REF!"}},{"$error":"#REF!"},{"$error":"#REF!"}]
[{"$error":"#REF!"},{"$f":"_xlfn.CHISQ.DIST(A679,#REF!,FALSE)","v":{"$error":"#REF!"}},{"$error":"#REF!"},{"$error":"#REF!"}]
[{"$error":"#REF!"},{"$f":"_xlfn.CHISQ.DIST(A680,#REF!,FALSE)","v":{"$error":"#REF!"}},{"$error":"#REF!"},{"$error":"#REF!"}]
[{"$error":"#REF!"},{"$f":"_xlfn.CHISQ.DIST(A681,#REF!,FALSE)","v":{"$error":"#REF!"}},{"$error":"#REF!"},{"$error":"#REF!"}]
[{"$error":"#REF!"},{"$f":"_xlfn.CHISQ.DIST(A682,#REF!,FALSE)","v":{"$error":"#REF!"}},{"$error":"#REF!"},{"$error":"#REF!"}]
[{"$error":"#REF!"},{"$f":"_xlfn.CHISQ.DIST(A683,#REF!,FALSE)","v":{"$error":"#REF!"}},{"$error":"#REF!"},{"$error":"#REF!"}]
[{"$error":"#REF!"},{"$f":"_xlfn.CHISQ.DIST(A684,#REF!,FALSE)","v":{"$error":"#REF!"}},{"$error":"#REF!"},{"$error":"#REF!"}]
[{"$error":"#REF!"},{"$f":"_xlfn.CHISQ.DIST(A685,#REF!,FALSE)","v":{"$error":"#REF!"}},{"$error":"#REF!"},{"$error":"#REF!"}]
[{"$error":"#REF!"},{"$f":"_xlfn.CHISQ.DIST(A686,#REF!,FALSE)","v":{"$error":"#REF!"}},{"$error":"#REF!"},{"$error":"#REF!"}]
[{"$error":"#REF!"},{"$f":"_xlfn.CHISQ.DIST(A687,#REF!,FALSE)","v":{"$error":"#REF!"}},{"$error":"#REF!"},{"$error":"#REF!"}]
[{"$error":"#REF!"},{"$f":"_xlfn.CHISQ.DIST(A688,#REF!,FALSE)","v":{"$error":"#REF!"}},{"$error":"#REF!"},{"$error":"#REF!"}]
[{"$error":"#REF!"},{"$f":"_xlfn.CHISQ.DIST(A689,#REF!,FALSE)","v":{"$error":"#REF!"}},{"$error":"#REF!"},{"$error":"#REF!"}]
[{"$error":"#REF!"},{"$f":"_xlfn.CHISQ.DIST(A690,#REF!,FALSE)","v":{"$error":"#REF!"}},{"$error":"#REF!"},{"$error":"#REF!"}]
[{"$error":"#REF!"},{"$f":"_xlfn.CHISQ.DIST(A691,#REF!,FALSE)","v":{"$error":"#REF!"}},{"$error":"#REF!"},{"$error":"#REF!"}]
[{"$error":"#REF!"},{"$f":"_xlfn.CHISQ.DIST(A692,#REF!,FALSE)","v":{"$error":"#REF!"}},{"$error":"#REF!"},{"$error":"#REF!"}]
[{"$error":"#REF!"},{"$f":"_xlfn.CHISQ.DIST(A693,#REF!,FALSE)","v":{"$error":"#REF!"}},{"$error":"#REF!"},{"$error":"#REF!"}]
[{"$error":"#REF!"},{"$f":"_xlfn.CHISQ.DIST(A694,#REF!,FALSE)","v":{"$error":"#REF!"}},{"$error":"#REF!"},{"$error":"#REF!"}]
[{"$error":"#REF!"},{"$f":"_xlfn.CHISQ.DIST(A695,#REF!,FALSE)","v":{"$error":"#REF!"}},{"$error":"#REF!"},{"$error":"#REF!"}]
[{"$error":"#REF!"},{"$f":"_xlfn.CHISQ.DIST(A696,#REF!,FALSE)","v":{"$error":"#REF!"}},{"$error":"#REF!"},{"$error":"#REF!"}]
[{"$error":"#REF!"},{"$f":"_xlfn.CHISQ.DIST(A697,#REF!,FALSE)","v":{"$error":"#REF!"}},{"$error":"#REF!"},{"$error":"#REF!"}]
[{"$error":"#REF!"},{"$f":"_xlfn.CHISQ.DIST(A698,#REF!,FALSE)","v":{"$error":"#REF!"}},{"$error":"#REF!"},{"$error":"#REF!"}]
[{"$error":"#REF!"},{"$f":"_xlfn.CHISQ.DIST(A699,#REF!,FALSE)","v":{"$error":"#REF!"}},{"$error":"#REF!"},{"$error":"#REF!"}]
[{"$error":"#REF!"},{"$f":"_xlfn.CHISQ.DIST(A700,#REF!,FALSE)","v":{"$error":"#REF!"}},{"$error":"#REF!"},{"$error":"#REF!"}]
[{"$error":"#REF!"},{"$f":"_xlfn.CHISQ.DIST(A701,#REF!,FALSE)","v":{"$error":"#REF!"}},{"$error":"#REF!"},{"$error":"#REF!"}]
[{"$error":"#REF!"},{"$f":"_xlfn.CHISQ.DIST(A702,#REF!,FALSE)","v":{"$error":"#REF!"}},{"$error":"#REF!"},{"$error":"#REF!"}]
[{"$error":"#REF!"},{"$f":"_xlfn.CHISQ.DIST(A703,#REF!,FALSE)","v":{"$error":"#REF!"}},{"$error":"#REF!"},{"$error":"#REF!"}]
[{"$error":"#REF!"},{"$f":"_xlfn.CHISQ.DIST(A704,#REF!,FALSE)","v":{"$error":"#REF!"}},{"$error":"#REF!"},{"$error":"#REF!"}]
[{"$error":"#REF!"},{"$f":"_xlfn.CHISQ.DIST(A705,#REF!,FALSE)","v":{"$error":"#REF!"}},{"$error":"#REF!"},{"$error":"#REF!"}]
[{"$error":"#REF!"},{"$f":"_xlfn.CHISQ.DIST(A706,#REF!,FALSE)","v":{"$error":"#REF!"}},{"$error":"#REF!"},{"$error":"#REF!"}]
[{"$error":"#REF!"},{"$f":"_xlfn.CHISQ.DIST(A707,#REF!,FALSE)","v":{"$error":"#REF!"}},{"$error":"#REF!"},{"$error":"#REF!"}]
[{"$error":"#REF!"},{"$f":"_xlfn.CHISQ.DIST(A708,#REF!,FALSE)","v":{"$error":"#REF!"}},{"$error":"#REF!"},{"$error":"#REF!"}]
[{"$error":"#REF!"},{"$f":"_xlfn.CHISQ.DIST(A709,#REF!,FALSE)","v":{"$error":"#REF!"}},{"$error":"#REF!"},{"$error":"#REF!"}]
[{"$error":"#REF!"},{"$f":"_xlfn.CHISQ.DIST(A710,#REF!,FALSE)","v":{"$error":"#REF!"}},{"$error":"#REF!"},{"$error":"#REF!"}]
[{"$error":"#REF!"},{"$f":"_xlfn.CHISQ.DIST(A711,#REF!,FALSE)","v":{"$error":"#REF!"}},{"$error":"#REF!"},{"$error":"#REF!"}]
[{"$error":"#REF!"},{"$f":"_xlfn.CHISQ.DIST(A712,#REF!,FALSE)","v":{"$error":"#REF!"}},{"$error":"#REF!"},{"$error":"#REF!"}]
[{"$error":"#REF!"},{"$f":"_xlfn.CHISQ.DIST(A713,#REF!,FALSE)","v":{"$error":"#REF!"}},{"$f":"IF($A713<$D$3,IF($A714>$D$3,MAX($B$9:$B$1009),\"\"),\"\")","v":{"$error":"#REF!"}},{"$f":"IF($A713<$D$4,IF($A714>$D$4,MAX($B$9:$B$1009),\"\"),\"\")","v":{"$error":"#REF!"}}]
[{"$f":"+A713+$B$4","v":{"$error":"#REF!"}},{"$f":"_xlfn.CHISQ.DIST(A714,#REF!,FALSE)","v":{"$error":"#REF!"}},{"$error":"#REF!"},{"$error":"#REF!"}]
[{"$error":"#REF!"},{"$f":"_xlfn.CHISQ.DIST(A715,#REF!,FALSE)","v":{"$error":"#REF!"}},{"$error":"#REF!"},{"$error":"#REF!"}]
[{"$error":"#REF!"},{"$f":"_xlfn.CHISQ.DIST(A716,#REF!,FALSE)","v":{"$error":"#REF!"}},{"$error":"#REF!"},{"$error":"#REF!"}]
[{"$error":"#REF!"},{"$f":"_xlfn.CHISQ.DIST(A717,#REF!,FALSE)","v":{"$error":"#REF!"}},{"$error":"#REF!"},{"$error":"#REF!"}]
[{"$error":"#REF!"},{"$f":"_xlfn.CHISQ.DIST(A718,#REF!,FALSE)","v":{"$error":"#REF!"}},{"$error":"#REF!"},{"$error":"#REF!"}]
[{"$error":"#REF!"},{"$f":"_xlfn.CHISQ.DIST(A719,#REF!,FALSE)","v":{"$error":"#REF!"}},{"$error":"#REF!"},{"$error":"#REF!"}]
[{"$error":"#REF!"},{"$f":"_xlfn.CHISQ.DIST(A720,#REF!,FALSE)","v":{"$error":"#REF!"}},{"$error":"#REF!"},{"$error":"#REF!"}]
[{"$error":"#REF!"},{"$f":"_xlfn.CHISQ.DIST(A721,#REF!,FALSE)","v":{"$error":"#REF!"}},{"$error":"#REF!"},{"$error":"#REF!"}]
[{"$error":"#REF!"},{"$f":"_xlfn.CHISQ.DIST(A722,#REF!,FALSE)","v":{"$error":"#REF!"}},{"$error":"#REF!"},{"$error":"#REF!"}]
[{"$error":"#REF!"},{"$f":"_xlfn.CHISQ.DIST(A723,#REF!,FALSE)","v":{"$error":"#REF!"}},{"$error":"#REF!"},{"$error":"#REF!"}]
[{"$error":"#REF!"},{"$f":"_xlfn.CHISQ.DIST(A724,#REF!,FALSE)","v":{"$error":"#REF!"}},{"$error":"#REF!"},{"$error":"#REF!"}]
[{"$error":"#REF!"},{"$f":"_xlfn.CHISQ.DIST(A725,#REF!,FALSE)","v":{"$error":"#REF!"}},{"$error":"#REF!"},{"$error":"#REF!"}]
[{"$error":"#REF!"},{"$f":"_xlfn.CHISQ.DIST(A726,#REF!,FALSE)","v":{"$error":"#REF!"}},{"$error":"#REF!"},{"$error":"#REF!"}]
[{"$error":"#REF!"},{"$f":"_xlfn.CHISQ.DIST(A727,#REF!,FALSE)","v":{"$error":"#REF!"}},{"$error":"#REF!"},{"$error":"#REF!"}]
[{"$error":"#REF!"},{"$f":"_xlfn.CHISQ.DIST(A728,#REF!,FALSE)","v":{"$error":"#REF!"}},{"$error":"#REF!"},{"$error":"#REF!"}]
[{"$error":"#REF!"},{"$f":"_xlfn.CHISQ.DIST(A729,#REF!,FALSE)","v":{"$error":"#REF!"}},{"$error":"#REF!"},{"$error":"#REF!"}]
[{"$error":"#REF!"},{"$f":"_xlfn.CHISQ.DIST(A730,#REF!,FALSE)","v":{"$error":"#REF!"}},{"$error":"#REF!"},{"$error":"#REF!"}]
[{"$error":"#REF!"},{"$f":"_xlfn.CHISQ.DIST(A731,#REF!,FALSE)","v":{"$error":"#REF!"}},{"$error":"#REF!"},{"$error":"#REF!"}]
[{"$error":"#REF!"},{"$f":"_xlfn.CHISQ.DIST(A732,#REF!,FALSE)","v":{"$error":"#REF!"}},{"$error":"#REF!"},{"$error":"#REF!"}]
[{"$error":"#REF!"},{"$f":"_xlfn.CHISQ.DIST(A733,#REF!,FALSE)","v":{"$error":"#REF!"}},{"$error":"#REF!"},{"$error":"#REF!"}]
[{"$error":"#REF!"},{"$f":"_xlfn.CHISQ.DIST(A734,#REF!,FALSE)","v":{"$error":"#REF!"}},{"$error":"#REF!"},{"$error":"#REF!"}]
[{"$error":"#REF!"},{"$f":"_xlfn.CHISQ.DIST(A735,#REF!,FALSE)","v":{"$error":"#REF!"}},{"$error":"#REF!"},{"$error":"#REF!"}]
[{"$error":"#REF!"},{"$f":"_xlfn.CHISQ.DIST(A736,#REF!,FALSE)","v":{"$error":"#REF!"}},{"$error":"#REF!"},{"$error":"#REF!"}]
[{"$error":"#REF!"},{"$f":"_xlfn.CHISQ.DIST(A737,#REF!,FALSE)","v":{"$error":"#REF!"}},{"$error":"#REF!"},{"$error":"#REF!"}]
[{"$error":"#REF!"},{"$f":"_xlfn.CHISQ.DIST(A738,#REF!,FALSE)","v":{"$error":"#REF!"}},{"$error":"#REF!"},{"$error":"#REF!"}]
[{"$error":"#REF!"},{"$f":"_xlfn.CHISQ.DIST(A739,#REF!,FALSE)","v":{"$error":"#REF!"}},{"$error":"#REF!"},{"$error":"#REF!"}]
[{"$error":"#REF!"},{"$f":"_xlfn.CHISQ.DIST(A740,#REF!,FALSE)","v":{"$error":"#REF!"}},{"$error":"#REF!"},{"$error":"#REF!"}]
[{"$error":"#REF!"},{"$f":"_xlfn.CHISQ.DIST(A741,#REF!,FALSE)","v":{"$error":"#REF!"}},{"$error":"#REF!"},{"$error":"#REF!"}]
[{"$error":"#REF!"},{"$f":"_xlfn.CHISQ.DIST(A742,#REF!,FALSE)","v":{"$error":"#REF!"}},{"$error":"#REF!"},{"$error":"#REF!"}]
[{"$error":"#REF!"},{"$f":"_xlfn.CHISQ.DIST(A743,#REF!,FALSE)","v":{"$error":"#REF!"}},{"$error":"#REF!"},{"$error":"#REF!"}]
[{"$error":"#REF!"},{"$f":"_xlfn.CHISQ.DIST(A744,#REF!,FALSE)","v":{"$error":"#REF!"}},{"$error":"#REF!"},{"$error":"#REF!"}]
[{"$error":"#REF!"},{"$f":"_xlfn.CHISQ.DIST(A745,#REF!,FALSE)","v":{"$error":"#REF!"}},{"$error":"#REF!"},{"$error":"#REF!"}]
[{"$error":"#REF!"},{"$f":"_xlfn.CHISQ.DIST(A746,#REF!,FALSE)","v":{"$error":"#REF!"}},{"$error":"#REF!"},{"$error":"#REF!"}]
[{"$error":"#REF!"},{"$f":"_xlfn.CHISQ.DIST(A747,#REF!,FALSE)","v":{"$error":"#REF!"}},{"$error":"#REF!"},{"$error":"#REF!"}]
[{"$error":"#REF!"},{"$f":"_xlfn.CHISQ.DIST(A748,#REF!,FALSE)","v":{"$error":"#REF!"}},{"$error":"#REF!"},{"$error":"#REF!"}]
[{"$error":"#REF!"},{"$f":"_xlfn.CHISQ.DIST(A749,#REF!,FALSE)","v":{"$error":"#REF!"}},{"$error":"#REF!"},{"$error":"#REF!"}]
[{"$error":"#REF!"},{"$f":"_xlfn.CHISQ.DIST(A750,#REF!,FALSE)","v":{"$error":"#REF!"}},{"$error":"#REF!"},{"$error":"#REF!"}]
[{"$error":"#REF!"},{"$f":"_xlfn.CHISQ.DIST(A751,#REF!,FALSE)","v":{"$error":"#REF!"}},{"$error":"#REF!"},{"$error":"#REF!"}]
[{"$error":"#REF!"},{"$f":"_xlfn.CHISQ.DIST(A752,#REF!,FALSE)","v":{"$error":"#REF!"}},{"$error":"#REF!"},{"$error":"#REF!"}]
[{"$error":"#REF!"},{"$f":"_xlfn.CHISQ.DIST(A753,#REF!,FALSE)","v":{"$error":"#REF!"}},{"$error":"#REF!"},{"$error":"#REF!"}]
[{"$error":"#REF!"},{"$f":"_xlfn.CHISQ.DIST(A754,#REF!,FALSE)","v":{"$error":"#REF!"}},{"$error":"#REF!"},{"$error":"#REF!"}]
[{"$error":"#REF!"},{"$f":"_xlfn.CHISQ.DIST(A755,#REF!,FALSE)","v":{"$error":"#REF!"}},{"$error":"#REF!"},{"$error":"#REF!"}]
[{"$error":"#REF!"},{"$f":"_xlfn.CHISQ.DIST(A756,#REF!,FALSE)","v":{"$error":"#REF!"}},{"$error":"#REF!"},{"$error":"#REF!"}]
[{"$error":"#REF!"},{"$f":"_xlfn.CHISQ.DIST(A757,#REF!,FALSE)","v":{"$error":"#REF!"}},{"$error":"#REF!"},{"$error":"#REF!"}]
[{"$error":"#REF!"},{"$f":"_xlfn.CHISQ.DIST(A758,#REF!,FALSE)","v":{"$error":"#REF!"}},{"$error":"#REF!"},{"$error":"#REF!"}]
[{"$error":"#REF!"},{"$f":"_xlfn.CHISQ.DIST(A759,#REF!,FALSE)","v":{"$error":"#REF!"}},{"$error":"#REF!"},{"$error":"#REF!"}]
[{"$error":"#REF!"},{"$f":"_xlfn.CHISQ.DIST(A760,#REF!,FALSE)","v":{"$error":"#REF!"}},{"$error":"#REF!"},{"$error":"#REF!"}]
[{"$error":"#REF!"},{"$f":"_xlfn.CHISQ.DIST(A761,#REF!,FALSE)","v":{"$error":"#REF!"}},{"$error":"#REF!"},{"$error":"#REF!"}]
[{"$error":"#REF!"},{"$f":"_xlfn.CHISQ.DIST(A762,#REF!,FALSE)","v":{"$error":"#REF!"}},{"$error":"#REF!"},{"$error":"#REF!"}]
[{"$error":"#REF!"},{"$f":"_xlfn.CHISQ.DIST(A763,#REF!,FALSE)","v":{"$error":"#REF!"}},{"$error":"#REF!"},{"$error":"#REF!"}]
[{"$error":"#REF!"},{"$f":"_xlfn.CHISQ.DIST(A764,#REF!,FALSE)","v":{"$error":"#REF!"}},{"$error":"#REF!"},{"$error":"#REF!"}]
[{"$error":"#REF!"},{"$f":"_xlfn.CHISQ.DIST(A765,#REF!,FALSE)","v":{"$error":"#REF!"}},{"$error":"#REF!"},{"$error":"#REF!"}]
[{"$error":"#REF!"},{"$f":"_xlfn.CHISQ.DIST(A766,#REF!,FALSE)","v":{"$error":"#REF!"}},{"$error":"#REF!"},{"$error":"#REF!"}]
[{"$error":"#REF!"},{"$f":"_xlfn.CHISQ.DIST(A767,#REF!,FALSE)","v":{"$error":"#REF!"}},{"$error":"#REF!"},{"$error":"#REF!"}]
[{"$error":"#REF!"},{"$f":"_xlfn.CHISQ.DIST(A768,#REF!,FALSE)","v":{"$error":"#REF!"}},{"$error":"#REF!"},{"$error":"#REF!"}]
[{"$error":"#REF!"},{"$f":"_xlfn.CHISQ.DIST(A769,#REF!,FALSE)","v":{"$error":"#REF!"}},{"$error":"#REF!"},{"$error":"#REF!"}]
[{"$error":"#REF!"},{"$f":"_xlfn.CHISQ.DIST(A770,#REF!,FALSE)","v":{"$error":"#REF!"}},{"$error":"#REF!"},{"$error":"#REF!"}]
[{"$error":"#REF!"},{"$f":"_xlfn.CHISQ.DIST(A771,#REF!,FALSE)","v":{"$error":"#REF!"}},{"$error":"#REF!"},{"$error":"#REF!"}]
[{"$error":"#REF!"},{"$f":"_xlfn.CHISQ.DIST(A772,#REF!,FALSE)","v":{"$error":"#REF!"}},{"$error":"#REF!"},{"$error":"#REF!"}]
[{"$error":"#REF!"},{"$f":"_xlfn.CHISQ.DIST(A773,#REF!,FALSE)","v":{"$error":"#REF!"}},{"$error":"#REF!"},{"$error":"#REF!"}]
[{"$error":"#REF!"},{"$f":"_xlfn.CHISQ.DIST(A774,#REF!,FALSE)","v":{"$error":"#REF!"}},{"$error":"#REF!"},{"$error":"#REF!"}]
[{"$error":"#REF!"},{"$f":"_xlfn.CHISQ.DIST(A775,#REF!,FALSE)","v":{"$error":"#REF!"}},{"$error":"#REF!"},{"$error":"#REF!"}]
[{"$error":"#REF!"},{"$f":"_xlfn.CHISQ.DIST(A776,#REF!,FALSE)","v":{"$error":"#REF!"}},{"$error":"#REF!"},{"$error":"#REF!"}]
[{"$error":"#REF!"},{"$f":"_xlfn.CHISQ.DIST(A777,#REF!,FALSE)","v":{"$error":"#REF!"}},{"$f":"IF($A777<$D$3,IF($A778>$D$3,MAX($B$9:$B$1009),\"\"),\"\")","v":{"$error":"#REF!"}},{"$f":"IF($A777<$D$4,IF($A778>$D$4,MAX($B$9:$B$1009),\"\"),\"\")","v":{"$error":"#REF!"}}]
[{"$f":"+A777+$B$4","v":{"$error":"#REF!"}},{"$f":"_xlfn.CHISQ.DIST(A778,#REF!,FALSE)","v":{"$error":"#REF!"}},{"$error":"#REF!"},{"$error":"#REF!"}]
[{"$error":"#REF!"},{"$f":"_xlfn.CHISQ.DIST(A779,#REF!,FALSE)","v":{"$error":"#REF!"}},{"$error":"#REF!"},{"$error":"#REF!"}]
[{"$error":"#REF!"},{"$f":"_xlfn.CHISQ.DIST(A780,#REF!,FALSE)","v":{"$error":"#REF!"}},{"$error":"#REF!"},{"$error":"#REF!"}]
[{"$error":"#REF!"},{"$f":"_xlfn.CHISQ.DIST(A781,#REF!,FALSE)","v":{"$error":"#REF!"}},{"$error":"#REF!"},{"$error":"#REF!"}]
[{"$error":"#REF!"},{"$f":"_xlfn.CHISQ.DIST(A782,#REF!,FALSE)","v":{"$error":"#REF!"}},{"$error":"#REF!"},{"$error":"#REF!"}]
[{"$error":"#REF!"},{"$f":"_xlfn.CHISQ.DIST(A783,#REF!,FALSE)","v":{"$error":"#REF!"}},{"$error":"#REF!"},{"$error":"#REF!"}]
[{"$error":"#REF!"},{"$f":"_xlfn.CHISQ.DIST(A784,#REF!,FALSE)","v":{"$error":"#REF!"}},{"$error":"#REF!"},{"$error":"#REF!"}]
[{"$error":"#REF!"},{"$f":"_xlfn.CHISQ.DIST(A785,#REF!,FALSE)","v":{"$error":"#REF!"}},{"$error":"#REF!"},{"$error":"#REF!"}]
[{"$error":"#REF!"},{"$f":"_xlfn.CHISQ.DIST(A786,#REF!,FALSE)","v":{"$error":"#REF!"}},{"$error":"#REF!"},{"$error":"#REF!"}]
[{"$error":"#REF!"},{"$f":"_xlfn.CHISQ.DIST(A787,#REF!,FALSE)","v":{"$error":"#REF!"}},{"$error":"#REF!"},{"$error":"#REF!"}]
[{"$error":"#REF!"},{"$f":"_xlfn.CHISQ.DIST(A788,#REF!,FALSE)","v":{"$error":"#REF!"}},{"$error":"#REF!"},{"$error":"#REF!"}]
[{"$error":"#REF!"},{"$f":"_xlfn.CHISQ.DIST(A789,#REF!,FALSE)","v":{"$error":"#REF!"}},{"$error":"#REF!"},{"$error":"#REF!"}]
[{"$error":"#REF!"},{"$f":"_xlfn.CHISQ.DIST(A790,#REF!,FALSE)","v":{"$error":"#REF!"}},{"$error":"#REF!"},{"$error":"#REF!"}]
[{"$error":"#REF!"},{"$f":"_xlfn.CHISQ.DIST(A791,#REF!,FALSE)","v":{"$error":"#REF!"}},{"$error":"#REF!"},{"$error":"#REF!"}]
[{"$error":"#REF!"},{"$f":"_xlfn.CHISQ.DIST(A792,#REF!,FALSE)","v":{"$error":"#REF!"}},{"$error":"#REF!"},{"$error":"#REF!"}]
[{"$error":"#REF!"},{"$f":"_xlfn.CHISQ.DIST(A793,#REF!,FALSE)","v":{"$error":"#REF!"}},{"$error":"#REF!"},{"$error":"#REF!"}]
[{"$error":"#REF!"},{"$f":"_xlfn.CHISQ.DIST(A794,#REF!,FALSE)","v":{"$error":"#REF!"}},{"$error":"#REF!"},{"$error":"#REF!"}]
[{"$error":"#REF!"},{"$f":"_xlfn.CHISQ.DIST(A795,#REF!,FALSE)","v":{"$error":"#REF!"}},{"$error":"#REF!"},{"$error":"#REF!"}]
[{"$error":"#REF!"},{"$f":"_xlfn.CHISQ.DIST(A796,#REF!,FALSE)","v":{"$error":"#REF!"}},{"$error":"#REF!"},{"$error":"#REF!"}]
[{"$error":"#REF!"},{"$f":"_xlfn.CHISQ.DIST(A797,#REF!,FALSE)","v":{"$error":"#REF!"}},{"$error":"#REF!"},{"$error":"#REF!"}]
[{"$error":"#REF!"},{"$f":"_xlfn.CHISQ.DIST(A798,#REF!,FALSE)","v":{"$error":"#REF!"}},{"$error":"#REF!"},{"$error":"#REF!"}]
[{"$error":"#REF!"},{"$f":"_xlfn.CHISQ.DIST(A799,#REF!,FALSE)","v":{"$error":"#REF!"}},{"$error":"#REF!"},{"$error":"#REF!"}]
[{"$error":"#REF!"},{"$f":"_xlfn.CHISQ.DIST(A800,#REF!,FALSE)","v":{"$error":"#REF!"}},{"$error":"#REF!"},{"$error":"#REF!"}]
[{"$error":"#REF!"},{"$f":"_xlfn.CHISQ.DIST(A801,#REF!,FALSE)","v":{"$error":"#REF!"}},{"$error":"#REF!"},{"$error":"#REF!"}]
[{"$error":"#REF!"},{"$f":"_xlfn.CHISQ.DIST(A802,#REF!,FALSE)","v":{"$error":"#REF!"}},{"$error":"#REF!"},{"$error":"#REF!"}]
[{"$error":"#REF!"},{"$f":"_xlfn.CHISQ.DIST(A803,#REF!,FALSE)","v":{"$error":"#REF!"}},{"$error":"#REF!"},{"$error":"#REF!"}]
[{"$error":"#REF!"},{"$f":"_xlfn.CHISQ.DIST(A804,#REF!,FALSE)","v":{"$error":"#REF!"}},{"$error":"#REF!"},{"$error":"#REF!"}]
[{"$error":"#REF!"},{"$f":"_xlfn.CHISQ.DIST(A805,#REF!,FALSE)","v":{"$error":"#REF!"}},{"$error":"#REF!"},{"$error":"#REF!"}]
[{"$error":"#REF!"},{"$f":"_xlfn.CHISQ.DIST(A806,#REF!,FALSE)","v":{"$error":"#REF!"}},{"$error":"#REF!"},{"$error":"#REF!"}]
[{"$error":"#REF!"},{"$f":"_xlfn.CHISQ.DIST(A807,#REF!,FALSE)","v":{"$error":"#REF!"}},{"$error":"#REF!"},{"$error":"#REF!"}]
[{"$error":"#REF!"},{"$f":"_xlfn.CHISQ.DIST(A808,#REF!,FALSE)","v":{"$error":"#REF!"}},{"$f":"IF($A808<$D$3,IF($A809>$D$3,MAX($B$9:$B$1009),\"\"),\"\")","v":{"$error":"#REF!"}},{"$error":"#REF!"}]
[{"$error":"#REF!"},{"$f":"_xlfn.CHISQ.DIST(A809,#REF!,FALSE)","v":{"$error":"#REF!"}},{"$error":"#REF!"},{"$error":"#REF!"}]
[{"$error":"#REF!"},{"$f":"_xlfn.CHISQ.DIST(A810,#REF!,FALSE)","v":{"$error":"#REF!"}},{"$error":"#REF!"},{"$error":"#REF!"}]
[{"$error":"#REF!"},{"$f":"_xlfn.CHISQ.DIST(A811,#REF!,FALSE)","v":{"$error":"#REF!"}},{"$error":"#REF!"},{"$error":"#REF!"}]
[{"$error":"#REF!"},{"$f":"_xlfn.CHISQ.DIST(A812,#REF!,FALSE)","v":{"$error":"#REF!"}},{"$error":"#REF!"},{"$error":"#REF!"}]
[{"$error":"#REF!"},{"$f":"_xlfn.CHISQ.DIST(A813,#REF!,FALSE)","v":{"$error":"#REF!"}},{"$error":"#REF!"},{"$error":"#REF!"}]
[{"$error":"#REF!"},{"$f":"_xlfn.CHISQ.DIST(A814,#REF!,FALSE)","v":{"$error":"#REF!"}},{"$error":"#REF!"},{"$error":"#REF!"}]
[{"$error":"#REF!"},{"$f":"_xlfn.CHISQ.DIST(A815,#REF!,FALSE)","v":{"$error":"#REF!"}},{"$error":"#REF!"},{"$error":"#REF!"}]
[{"$error":"#REF!"},{"$f":"_xlfn.CHISQ.DIST(A816,#REF!,FALSE)","v":{"$error":"#REF!"}},{"$error":"#REF!"},{"$error":"#REF!"}]
[{"$error":"#REF!"},{"$f":"_xlfn.CHISQ.DIST(A817,#REF!,FALSE)","v":{"$error":"#REF!"}},{"$error":"#REF!"},{"$error":"#REF!"}]
[{"$error":"#REF!"},{"$f":"_xlfn.CHISQ.DIST(A818,#REF!,FALSE)","v":{"$error":"#REF!"}},{"$error":"#REF!"},{"$error":"#REF!"}]
[{"$error":"#REF!"},{"$f":"_xlfn.CHISQ.DIST(A819,#REF!,FALSE)","v":{"$error":"#REF!"}},{"$error":"#REF!"},{"$error":"#REF!"}]
[{"$error":"#REF!"},{"$f":"_xlfn.CHISQ.DIST(A820,#REF!,FALSE)","v":{"$error":"#REF!"}},{"$error":"#REF!"},{"$error":"#REF!"}]
[{"$error":"#REF!"},{"$f":"_xlfn.CHISQ.DIST(A821,#REF!,FALSE)","v":{"$error":"#REF!"}},{"$error":"#REF!"},{"$error":"#REF!"}]
[{"$error":"#REF!"},{"$f":"_xlfn.CHISQ.DIST(A822,#REF!,FALSE)","v":{"$error":"#REF!"}},{"$error":"#REF!"},{"$error":"#REF!"}]
[{"$error":"#REF!"},{"$f":"_xlfn.CHISQ.DIST(A823,#REF!,FALSE)","v":{"$error":"#REF!"}},{"$error":"#REF!"},{"$error":"#REF!"}]
[{"$error":"#REF!"},{"$f":"_xlfn.CHISQ.DIST(A824,#REF!,FALSE)","v":{"$error":"#REF!"}},{"$error":"#REF!"},{"$error":"#REF!"}]
[{"$error":"#REF!"},{"$f":"_xlfn.CHISQ.DIST(A825,#REF!,FALSE)","v":{"$error":"#REF!"}},{"$error":"#REF!"},{"$error":"#REF!"}]
[{"$error":"#REF!"},{"$f":"_xlfn.CHISQ.DIST(A826,#REF!,FALSE)","v":{"$error":"#REF!"}},{"$error":"#REF!"},{"$error":"#REF!"}]
[{"$error":"#REF!"},{"$f":"_xlfn.CHISQ.DIST(A827,#REF!,FALSE)","v":{"$error":"#REF!"}},{"$error":"#REF!"},{"$error":"#REF!"}]
[{"$error":"#REF!"},{"$f":"_xlfn.CHISQ.DIST(A828,#REF!,FALSE)","v":{"$error":"#REF!"}},{"$error":"#REF!"},{"$error":"#REF!"}]
[{"$error":"#REF!"},{"$f":"_xlfn.CHISQ.DIST(A829,#REF!,FALSE)","v":{"$error":"#REF!"}},{"$error":"#REF!"},{"$error":"#REF!"}]
[{"$error":"#REF!"},{"$f":"_xlfn.CHISQ.DIST(A830,#REF!,FALSE)","v":{"$error":"#REF!"}},{"$error":"#REF!"},{"$error":"#REF!"}]
[{"$error":"#REF!"},{"$f":"_xlfn.CHISQ.DIST(A831,#REF!,FALSE)","v":{"$error":"#REF!"}},{"$error":"#REF!"},{"$error":"#REF!"}]
[{"$error":"#REF!"},{"$f":"_xlfn.CHISQ.DIST(A832,#REF!,FALSE)","v":{"$error":"#REF!"}},{"$error":"#REF!"},{"$error":"#REF!"}]
[{"$error":"#REF!"},{"$f":"_xlfn.CHISQ.DIST(A833,#REF!,FALSE)","v":{"$error":"#REF!"}},{"$error":"#REF!"},{"$error":"#REF!"}]
[{"$error":"#REF!"},{"$f":"_xlfn.CHISQ.DIST(A834,#REF!,FALSE)","v":{"$error":"#REF!"}},{"$error":"#REF!"},{"$error":"#REF!"}]
[{"$error":"#REF!"},{"$f":"_xlfn.CHISQ.DIST(A835,#REF!,FALSE)","v":{"$error":"#REF!"}},{"$error":"#REF!"},{"$error":"#REF!"}]
[{"$error":"#REF!"},{"$f":"_xlfn.CHISQ.DIST(A836,#REF!,FALSE)","v":{"$error":"#REF!"}},{"$error":"#REF!"},{"$error":"#REF!"}]
[{"$error":"#REF!"},{"$f":"_xlfn.CHISQ.DIST(A837,#REF!,FALSE)","v":{"$error":"#REF!"}},{"$error":"#REF!"},{"$error":"#REF!"}]
[{"$error":"#REF!"},{"$f":"_xlfn.CHISQ.DIST(A838,#REF!,FALSE)","v":{"$error":"#REF!"}},{"$error":"#REF!"},{"$error":"#REF!"}]
[{"$error":"#REF!"},{"$f":"_xlfn.CHISQ.DIST(A839,#REF!,FALSE)","v":{"$error":"#REF!"}},{"$error":"#REF!"},{"$error":"#REF!"}]
[{"$error":"#REF!"},{"$f":"_xlfn.CHISQ.DIST(A840,#REF!,FALSE)","v":{"$error":"#REF!"}},{"$error":"#REF!"},{"$error":"#REF!"}]
[{"$error":"#REF!"},{"$f":"_xlfn.CHISQ.DIST(A841,#REF!,FALSE)","v":{"$error":"#REF!"}},{"$f":"IF($A841<$D$3,IF($A842>$D$3,MAX($B$9:$B$1009),\"\"),\"\")","v":{"$error":"#REF!"}},{"$f":"IF($A841<$D$4,IF($A842>$D$4,MAX($B$9:$B$1009),\"\"),\"\")","v":{"$error":"#REF!"}}]
[{"$f":"+A841+$B$4","v":{"$error":"#REF!"}},{"$f":"_xlfn.CHISQ.DIST(A842,#REF!,FALSE)","v":{"$error":"#REF!"}},{"$error":"#REF!"},{"$error":"#REF!"}]
[{"$error":"#REF!"},{"$f":"_xlfn.CHISQ.DIST(A843,#REF!,FALSE)","v":{"$error":"#REF!"}},{"$error":"#REF!"},{"$error":"#REF!"}]
[{"$error":"#REF!"},{"$f":"_xlfn.CHISQ.DIST(A844,#REF!,FALSE)","v":{"$error":"#REF!"}},{"$error":"#REF!"},{"$error":"#REF!"}]
[{"$error":"#REF!"},{"$f":"_xlfn.CHISQ.DIST(A845,#REF!,FALSE)","v":{"$error":"#REF!"}},{"$error":"#REF!"},{"$error":"#REF!"}]
[{"$error":"#REF!"},{"$f":"_xlfn.CHISQ.DIST(A846,#REF!,FALSE)","v":{"$error":"#REF!"}},{"$error":"#REF!"},{"$error":"#REF!"}]
[{"$error":"#REF!"},{"$f":"_xlfn.CHISQ.DIST(A847,#REF!,FALSE)","v":{"$error":"#REF!"}},{"$error":"#REF!"},{"$error":"#REF!"}]
[{"$error":"#REF!"},{"$f":"_xlfn.CHISQ.DIST(A848,#REF!,FALSE)","v":{"$error":"#REF!"}},{"$error":"#REF!"},{"$error":"#REF!"}]
[{"$error":"#REF!"},{"$f":"_xlfn.CHISQ.DIST(A849,#REF!,FALSE)","v":{"$error":"#REF!"}},{"$error":"#REF!"},{"$error":"#REF!"}]
[{"$error":"#REF!"},{"$f":"_xlfn.CHISQ.DIST(A850,#REF!,FALSE)","v":{"$error":"#REF!"}},{"$error":"#REF!"},{"$error":"#REF!"}]
[{"$error":"#REF!"},{"$f":"_xlfn.CHISQ.DIST(A851,#REF!,FALSE)","v":{"$error":"#REF!"}},{"$error":"#REF!"},{"$error":"#REF!"}]
[{"$error":"#REF!"},{"$f":"_xlfn.CHISQ.DIST(A852,#REF!,FALSE)","v":{"$error":"#REF!"}},{"$error":"#REF!"},{"$error":"#REF!"}]
[{"$error":"#REF!"},{"$f":"_xlfn.CHISQ.DIST(A853,#REF!,FALSE)","v":{"$error":"#REF!"}},{"$error":"#REF!"},{"$error":"#REF!"}]
[{"$error":"#REF!"},{"$f":"_xlfn.CHISQ.DIST(A854,#REF!,FALSE)","v":{"$error":"#REF!"}},{"$error":"#REF!"},{"$error":"#REF!"}]
[{"$error":"#REF!"},{"$f":"_xlfn.CHISQ.DIST(A855,#REF!,FALSE)","v":{"$error":"#REF!"}},{"$error":"#REF!"},{"$error":"#REF!"}]
[{"$error":"#REF!"},{"$f":"_xlfn.CHISQ.DIST(A856,#REF!,FALSE)","v":{"$error":"#REF!"}},{"$error":"#REF!"},{"$error":"#REF!"}]
[{"$error":"#REF!"},{"$f":"_xlfn.CHISQ.DIST(A857,#REF!,FALSE)","v":{"$error":"#REF!"}},{"$error":"#REF!"},{"$error":"#REF!"}]
[{"$error":"#REF!"},{"$f":"_xlfn.CHISQ.DIST(A858,#REF!,FALSE)","v":{"$error":"#REF!"}},{"$error":"#REF!"},{"$error":"#REF!"}]
[{"$error":"#REF!"},{"$f":"_xlfn.CHISQ.DIST(A859,#REF!,FALSE)","v":{"$error":"#REF!"}},{"$error":"#REF!"},{"$error":"#REF!"}]
[{"$error":"#REF!"},{"$f":"_xlfn.CHISQ.DIST(A860,#REF!,FALSE)","v":{"$error":"#REF!"}},{"$error":"#REF!"},{"$error":"#REF!"}]
[{"$error":"#REF!"},{"$f":"_xlfn.CHISQ.DIST(A861,#REF!,FALSE)","v":{"$error":"#REF!"}},{"$error":"#REF!"},{"$error":"#REF!"}]
[{"$error":"#REF!"},{"$f":"_xlfn.CHISQ.DIST(A862,#REF!,FALSE)","v":{"$error":"#REF!"}},{"$error":"#REF!"},{"$error":"#REF!"}]
[{"$error":"#REF!"},{"$f":"_xlfn.CHISQ.DIST(A863,#REF!,FALSE)","v":{"$error":"#REF!"}},{"$error":"#REF!"},{"$error":"#REF!"}]
[{"$error":"#REF!"},{"$f":"_xlfn.CHISQ.DIST(A864,#REF!,FALSE)","v":{"$error":"#REF!"}},{"$error":"#REF!"},{"$error":"#REF!"}]
[{"$error":"#REF!"},{"$f":"_xlfn.CHISQ.DIST(A865,#REF!,FALSE)","v":{"$error":"#REF!"}},{"$error":"#REF!"},{"$error":"#REF!"}]
[{"$error":"#REF!"},{"$f":"_xlfn.CHISQ.DIST(A866,#REF!,FALSE)","v":{"$error":"#REF!"}},{"$error":"#REF!"},{"$error":"#REF!"}]
[{"$error":"#REF!"},{"$f":"_xlfn.CHISQ.DIST(A867,#REF!,FALSE)","v":{"$error":"#REF!"}},{"$error":"#REF!"},{"$error":"#REF!"}]
[{"$error":"#REF!"},{"$f":"_xlfn.CHISQ.DIST(A868,#REF!,FALSE)","v":{"$error":"#REF!"}},{"$error":"#REF!"},{"$error":"#REF!"}]
[{"$error":"#REF!"},{"$f":"_xlfn.CHISQ.DIST(A869,#REF!,FALSE)","v":{"$error":"#REF!"}},{"$error":"#REF!"},{"$error":"#REF!"}]
[{"$error":"#REF!"},{"$f":"_xlfn.CHISQ.DIST(A870,#REF!,FALSE)","v":{"$error":"#REF!"}},{"$error":"#REF!"},{"$error":"#REF!"}]
[{"$error":"#REF!"},{"$f":"_xlfn.CHISQ.DIST(A871,#REF!,FALSE)","v":{"$error":"#REF!"}},{"$error":"#REF!"},{"$error":"#REF!"}]
[{"$error":"#REF!"},{"$f":"_xlfn.CHISQ.DIST(A872,#REF!,FALSE)","v":{"$error":"#REF!"}},{"$error":"#REF!"},{"$error":"#REF!"}]
[{"$error":"#REF!"},{"$f":"_xlfn.CHISQ.DIST(A873,#REF!,FALSE)","v":{"$error":"#REF!"}},{"$error":"#REF!"},{"$error":"#REF!"}]
[{"$error":"#REF!"},{"$f":"_xlfn.CHISQ.DIST(A874,#REF!,FALSE)","v":{"$error":"#REF!"}},{"$error":"#REF!"},{"$error":"#REF!"}]
[{"$error":"#REF!"},{"$f":"_xlfn.CHISQ.DIST(A875,#REF!,FALSE)","v":{"$error":"#REF!"}},{"$error":"#REF!"},{"$error":"#REF!"}]
[{"$error":"#REF!"},{"$f":"_xlfn.CHISQ.DIST(A876,#REF!,FALSE)","v":{"$error":"#REF!"}},{"$error":"#REF!"},{"$error":"#REF!"}]
[{"$error":"#REF!"},{"$f":"_xlfn.CHISQ.DIST(A877,#REF!,FALSE)","v":{"$error":"#REF!"}},{"$error":"#REF!"},{"$error":"#REF!"}]
[{"$error":"#REF!"},{"$f":"_xlfn.CHISQ.DIST(A878,#REF!,FALSE)","v":{"$error":"#REF!"}},{"$error":"#REF!"},{"$error":"#REF!"}]
[{"$error":"#REF!"},{"$f":"_xlfn.CHISQ.DIST(A879,#REF!,FALSE)","v":{"$error":"#REF!"}},{"$error":"#REF!"},{"$error":"#REF!"}]
[{"$error":"#REF!"},{"$f":"_xlfn.CHISQ.DIST(A880,#REF!,FALSE)","v":{"$error":"#REF!"}},{"$error":"#REF!"},{"$error":"#REF!"}]
[{"$error":"#REF!"},{"$f":"_xlfn.CHISQ.DIST(A881,#REF!,FALSE)","v":{"$error":"#REF!"}},{"$error":"#REF!"},{"$error":"#REF!"}]
[{"$error":"#REF!"},{"$f":"_xlfn.CHISQ.DIST(A882,#REF!,FALSE)","v":{"$error":"#REF!"}},{"$error":"#REF!"},{"$error":"#REF!"}]
[{"$error":"#REF!"},{"$f":"_xlfn.CHISQ.DIST(A883,#REF!,FALSE)","v":{"$error":"#REF!"}},{"$error":"#REF!"},{"$error":"#REF!"}]
[{"$error":"#REF!"},{"$f":"_xlfn.CHISQ.DIST(A884,#REF!,FALSE)","v":{"$error":"#REF!"}},{"$error":"#REF!"},{"$error":"#REF!"}]
[{"$error":"#REF!"},{"$f":"_xlfn.CHISQ.DIST(A885,#REF!,FALSE)","v":{"$error":"#REF!"}},{"$error":"#REF!"},{"$error":"#REF!"}]
[{"$error":"#REF!"},{"$f":"_xlfn.CHISQ.DIST(A886,#REF!,FALSE)","v":{"$error":"#REF!"}},{"$error":"#REF!"},{"$error":"#REF!"}]
[{"$error":"#REF!"},{"$f":"_xlfn.CHISQ.DIST(A887,#REF!,FALSE)","v":{"$error":"#REF!"}},{"$error":"#REF!"},{"$error":"#REF!"}]
[{"$error":"#REF!"},{"$f":"_xlfn.CHISQ.DIST(A888,#REF!,FALSE)","v":{"$error":"#REF!"}},{"$error":"#REF!"},{"$error":"#REF!"}]
[{"$error":"#REF!"},{"$f":"_xlfn.CHISQ.DIST(A889,#REF!,FALSE)","v":{"$error":"#REF!"}},{"$error":"#REF!"},{"$error":"#REF!"}]
[{"$error":"#REF!"},{"$f":"_xlfn.CHISQ.DIST(A890,#REF!,FALSE)","v":{"$error":"#REF!"}},{"$error":"#REF!"},{"$error":"#REF!"}]
[{"$error":"#REF!"},{"$f":"_xlfn.CHISQ.DIST(A891,#REF!,FALSE)","v":{"$error":"#REF!"}},{"$error":"#REF!"},{"$error":"#REF!"}]
[{"$error":"#REF!"},{"$f":"_xlfn.CHISQ.DIST(A892,#REF!,FALSE)","v":{"$error":"#REF!"}},{"$error":"#REF!"},{"$error":"#REF!"}]
[{"$error":"#REF!"},{"$f":"_xlfn.CHISQ.DIST(A893,#REF!,FALSE)","v":{"$error":"#REF!"}},{"$error":"#REF!"},{"$error":"#REF!"}]
[{"$error":"#REF!"},{"$f":"_xlfn.CHISQ.DIST(A894,#REF!,FALSE)","v":{"$error":"#REF!"}},{"$error":"#REF!"},{"$error":"#REF!"}]
[{"$error":"#REF!"},{"$f":"_xlfn.CHISQ.DIST(A895,#REF!,FALSE)","v":{"$error":"#REF!"}},{"$error":"#REF!"},{"$error":"#REF!"}]
[{"$error":"#REF!"},{"$f":"_xlfn.CHISQ.DIST(A896,#REF!,FALSE)","v":{"$error":"#REF!"}},{"$error":"#REF!"},{"$error":"#REF!"}]
[{"$error":"#REF!"},{"$f":"_xlfn.CHISQ.DIST(A897,#REF!,FALSE)","v":{"$error":"#REF!"}},{"$error":"#REF!"},{"$error":"#REF!"}]
[{"$error":"#REF!"},{"$f":"_xlfn.CHISQ.DIST(A898,#REF!,FALSE)","v":{"$error":"#REF!"}},{"$error":"#REF!"},{"$error":"#REF!"}]
[{"$error":"#REF!"},{"$f":"_xlfn.CHISQ.DIST(A899,#REF!,FALSE)","v":{"$error":"#REF!"}},{"$error":"#REF!"},{"$error":"#REF!"}]
[{"$error":"#REF!"},{"$f":"_xlfn.CHISQ.DIST(A900,#REF!,FALSE)","v":{"$error":"#REF!"}},{"$error":"#REF!"},{"$error":"#REF!"}]
[{"$error":"#REF!"},{"$f":"_xlfn.CHISQ.DIST(A901,#REF!,FALSE)","v":{"$error":"#REF!"}},{"$error":"#REF!"},{"$error":"#REF!"}]
[{"$error":"#REF!"},{"$f":"_xlfn.CHISQ.DIST(A902,#REF!,FALSE)","v":{"$error":"#REF!"}},{"$error":"#REF!"},{"$error":"#REF!"}]
[{"$error":"#REF!"},{"$f":"_xlfn.CHISQ.DIST(A903,#REF!,FALSE)","v":{"$error":"#REF!"}},{"$error":"#REF!"},{"$error":"#REF!"}]
[{"$error":"#REF!"},{"$f":"_xlfn.CHISQ.DIST(A904,#REF!,FALSE)","v":{"$error":"#REF!"}},{"$error":"#REF!"},{"$error":"#REF!"}]
[{"$error":"#REF!"},{"$f":"_xlfn.CHISQ.DIST(A905,#REF!,FALSE)","v":{"$error":"#REF!"}},{"$f":"IF($A905<$D$3,IF($A906>$D$3,MAX($B$9:$B$1009),\"\"),\"\")","v":{"$error":"#REF!"}},{"$f":"IF($A905<$D$4,IF($A906>$D$4,MAX($B$9:$B$1009),\"\"),\"\")","v":{"$error":"#REF!"}}]
[{"$f":"+A905+$B$4","v":{"$error":"#REF!"}},{"$f":"_xlfn.CHISQ.DIST(A906,#REF!,FALSE)","v":{"$error":"#REF!"}},{"$error":"#REF!"},{"$error":"#REF!"}]
[{"$error":"#REF!"},{"$f":"_xlfn.CHISQ.DIST(A907,#REF!,FALSE)","v":{"$error":"#REF!"}},{"$error":"#REF!"},{"$error":"#REF!"}]
[{"$error":"#REF!"},{"$f":"_xlfn.CHISQ.DIST(A908,#REF!,FALSE)","v":{"$error":"#REF!"}},{"$error":"#REF!"},{"$error":"#REF!"}]
[{"$error":"#REF!"},{"$f":"_xlfn.CHISQ.DIST(A909,#REF!,FALSE)","v":{"$error":"#REF!"}},{"$error":"#REF!"},{"$error":"#REF!"}]
[{"$error":"#REF!"},{"$f":"_xlfn.CHISQ.DIST(A910,#REF!,FALSE)","v":{"$error":"#REF!"}},{"$error":"#REF!"},{"$error":"#REF!"}]
[{"$error":"#REF!"},{"$f":"_xlfn.CHISQ.DIST(A911,#REF!,FALSE)","v":{"$error":"#REF!"}},{"$error":"#REF!"},{"$error":"#REF!"}]
[{"$error":"#REF!"},{"$f":"_xlfn.CHISQ.DIST(A912,#REF!,FALSE)","v":{"$error":"#REF!"}},{"$error":"#REF!"},{"$error":"#REF!"}]
[{"$error":"#REF!"},{"$f":"_xlfn.CHISQ.DIST(A913,#REF!,FALSE)","v":{"$error":"#REF!"}},{"$error":"#REF!"},{"$error":"#REF!"}]
[{"$error":"#REF!"},{"$f":"_xlfn.CHISQ.DIST(A914,#REF!,FALSE)","v":{"$error":"#REF!"}},{"$error":"#REF!"},{"$error":"#REF!"}]
[{"$error":"#REF!"},{"$f":"_xlfn.CHISQ.DIST(A915,#REF!,FALSE)","v":{"$error":"#REF!"}},{"$error":"#REF!"},{"$error":"#REF!"}]
[{"$error":"#REF!"},{"$f":"_xlfn.CHISQ.DIST(A916,#REF!,FALSE)","v":{"$error":"#REF!"}},{"$error":"#REF!"},{"$error":"#REF!"}]
[{"$error":"#REF!"},{"$f":"_xlfn.CHISQ.DIST(A917,#REF!,FALSE)","v":{"$error":"#REF!"}},{"$error":"#REF!"},{"$error":"#REF!"}]
[{"$error":"#REF!"},{"$f":"_xlfn.CHISQ.DIST(A918,#REF!,FALSE)","v":{"$error":"#REF!"}},{"$error":"#REF!"},{"$error":"#REF!"}]
[{"$error":"#REF!"},{"$f":"_xlfn.CHISQ.DIST(A919,#REF!,FALSE)","v":{"$error":"#REF!"}},{"$error":"#REF!"},{"$error":"#REF!"}]
[{"$error":"#REF!"},{"$f":"_xlfn.CHISQ.DIST(A920,#REF!,FALSE)","v":{"$error":"#REF!"}},{"$error":"#REF!"},{"$error":"#REF!"}]
[{"$error":"#REF!"},{"$f":"_xlfn.CHISQ.DIST(A921,#REF!,FALSE)","v":{"$error":"#REF!"}},{"$error":"#REF!"},{"$error":"#REF!"}]
[{"$error":"#REF!"},{"$f":"_xlfn.CHISQ.DIST(A922,#REF!,FALSE)","v":{"$error":"#REF!"}},{"$error":"#REF!"},{"$error":"#REF!"}]
[{"$error":"#REF!"},{"$f":"_xlfn.CHISQ.DIST(A923,#REF!,FALSE)","v":{"$error":"#REF!"}},{"$error":"#REF!"},{"$error":"#REF!"}]
[{"$error":"#REF!"},{"$f":"_xlfn.CHISQ.DIST(A924,#REF!,FALSE)","v":{"$error":"#REF!"}},{"$error":"#REF!"},{"$error":"#REF!"}]
[{"$error":"#REF!"},{"$f":"_xlfn.CHISQ.DIST(A925,#REF!,FALSE)","v":{"$error":"#REF!"}},{"$error":"#REF!"},{"$error":"#REF!"}]
[{"$error":"#REF!"},{"$f":"_xlfn.CHISQ.DIST(A926,#REF!,FALSE)","v":{"$error":"#REF!"}},{"$error":"#REF!"},{"$error":"#REF!"}]
[{"$error":"#REF!"},{"$f":"_xlfn.CHISQ.DIST(A927,#REF!,FALSE)","v":{"$error":"#REF!"}},{"$error":"#REF!"},{"$error":"#REF!"}]
[{"$error":"#REF!"},{"$f":"_xlfn.CHISQ.DIST(A928,#REF!,FALSE)","v":{"$error":"#REF!"}},{"$error":"#REF!"},{"$error":"#REF!"}]
[{"$error":"#REF!"},{"$f":"_xlfn.CHISQ.DIST(A929,#REF!,FALSE)","v":{"$error":"#REF!"}},{"$error":"#REF!"},{"$error":"#REF!"}]
[{"$error":"#REF!"},{"$f":"_xlfn.CHISQ.DIST(A930,#REF!,FALSE)","v":{"$error":"#REF!"}},{"$error":"#REF!"},{"$error":"#REF!"}]
[{"$error":"#REF!"},{"$f":"_xlfn.CHISQ.DIST(A931,#REF!,FALSE)","v":{"$error":"#REF!"}},{"$error":"#REF!"},{"$error":"#REF!"}]
[{"$error":"#REF!"},{"$f":"_xlfn.CHISQ.DIST(A932,#REF!,FALSE)","v":{"$error":"#REF!"}},{"$error":"#REF!"},{"$error":"#REF!"}]
[{"$error":"#REF!"},{"$f":"_xlfn.CHISQ.DIST(A933,#REF!,FALSE)","v":{"$error":"#REF!"}},{"$error":"#REF!"},{"$error":"#REF!"}]
[{"$error":"#REF!"},{"$f":"_xlfn.CHISQ.DIST(A934,#REF!,FALSE)","v":{"$error":"#REF!"}},{"$error":"#REF!"},{"$error":"#REF!"}]
[{"$error":"#REF!"},{"$f":"_xlfn.CHISQ.DIST(A935,#REF!,FALSE)","v":{"$error":"#REF!"}},{"$error":"#REF!"},{"$error":"#REF!"}]
[{"$error":"#REF!"},{"$f":"_xlfn.CHISQ.DIST(A936,#REF!,FALSE)","v":{"$error":"#REF!"}},{"$error":"#REF!"},{"$error":"#REF!"}]
[{"$error":"#REF!"},{"$f":"_xlfn.CHISQ.DIST(A937,#REF!,FALSE)","v":{"$error":"#REF!"}},{"$error":"#REF!"},{"$error":"#REF!"}]
[{"$error":"#REF!"},{"$f":"_xlfn.CHISQ.DIST(A938,#REF!,FALSE)","v":{"$error":"#REF!"}},{"$error":"#REF!"},{"$error":"#REF!"}]
[{"$error":"#REF!"},{"$f":"_xlfn.CHISQ.DIST(A939,#REF!,FALSE)","v":{"$error":"#REF!"}},{"$error":"#REF!"},{"$error":"#REF!"}]
[{"$error":"#REF!"},{"$f":"_xlfn.CHISQ.DIST(A940,#REF!,FALSE)","v":{"$error":"#REF!"}},{"$error":"#REF!"},{"$error":"#REF!"}]
[{"$error":"#REF!"},{"$f":"_xlfn.CHISQ.DIST(A941,#REF!,FALSE)","v":{"$error":"#REF!"}},{"$error":"#REF!"},{"$error":"#REF!"}]
[{"$error":"#REF!"},{"$f":"_xlfn.CHISQ.DIST(A942,#REF!,FALSE)","v":{"$error":"#REF!"}},{"$error":"#REF!"},{"$error":"#REF!"}]
[{"$error":"#REF!"},{"$f":"_xlfn.CHISQ.DIST(A943,#REF!,FALSE)","v":{"$error":"#REF!"}},{"$error":"#REF!"},{"$error":"#REF!"}]
[{"$error":"#REF!"},{"$f":"_xlfn.CHISQ.DIST(A944,#REF!,FALSE)","v":{"$error":"#REF!"}},{"$error":"#REF!"},{"$error":"#REF!"}]
[{"$error":"#REF!"},{"$f":"_xlfn.CHISQ.DIST(A945,#REF!,FALSE)","v":{"$error":"#REF!"}},{"$error":"#REF!"},{"$error":"#REF!"}]
[{"$error":"#REF!"},{"$f":"_xlfn.CHISQ.DIST(A946,#REF!,FALSE)","v":{"$error":"#REF!"}},{"$error":"#REF!"},{"$error":"#REF!"}]
[{"$error":"#REF!"},{"$f":"_xlfn.CHISQ.DIST(A947,#REF!,FALSE)","v":{"$error":"#REF!"}},{"$error":"#REF!"},{"$error":"#REF!"}]
[{"$error":"#REF!"},{"$f":"_xlfn.CHISQ.DIST(A948,#REF!,FALSE)","v":{"$error":"#REF!"}},{"$error":"#REF!"},{"$error":"#REF!"}]
[{"$error":"#REF!"},{"$f":"_xlfn.CHISQ.DIST(A949,#REF!,FALSE)","v":{"$error":"#REF!"}},{"$error":"#REF!"},{"$error":"#REF!"}]
[{"$error":"#REF!"},{"$f":"_xlfn.CHISQ.DIST(A950,#REF!,FALSE)","v":{"$error":"#REF!"}},{"$error":"#REF!"},{"$error":"#REF!"}]
[{"$error":"#REF!"},{"$f":"_xlfn.CHISQ.DIST(A951,#REF!,FALSE)","v":{"$error":"#REF!"}},{"$error":"#REF!"},{"$error":"#REF!"}]
[{"$error":"#REF!"},{"$f":"_xlfn.CHISQ.DIST(A952,#REF!,FALSE)","v":{"$error":"#REF!"}},{"$error":"#REF!"},{"$error":"#REF!"}]
[{"$error":"#REF!"},{"$f":"_xlfn.CHISQ.DIST(A953,#REF!,FALSE)","v":{"$error":"#REF!"}},{"$error":"#REF!"},{"$error":"#REF!"}]
[{"$error":"#REF!"},{"$f":"_xlfn.CHISQ.DIST(A954,#REF!,FALSE)","v":{"$error":"#REF!"}},{"$error":"#REF!"},{"$error":"#REF!"}]
[{"$error":"#REF!"},{"$f":"_xlfn.CHISQ.DIST(A955,#REF!,FALSE)","v":{"$error":"#REF!"}},{"$error":"#REF!"},{"$error":"#REF!"}]
[{"$error":"#REF!"},{"$f":"_xlfn.CHISQ.DIST(A956,#REF!,FALSE)","v":{"$error":"#REF!"}},{"$error":"#REF!"},{"$error":"#REF!"}]
[{"$error":"#REF!"},{"$f":"_xlfn.CHISQ.DIST(A957,#REF!,FALSE)","v":{"$error":"#REF!"}},{"$error":"#REF!"},{"$error":"#REF!"}]
[{"$error":"#REF!"},{"$f":"_xlfn.CHISQ.DIST(A958,#REF!,FALSE)","v":{"$error":"#REF!"}},{"$error":"#REF!"},{"$error":"#REF!"}]
[{"$error":"#REF!"},{"$f":"_xlfn.CHISQ.DIST(A959,#REF!,FALSE)","v":{"$error":"#REF!"}},{"$error":"#REF!"},{"$error":"#REF!"}]
[{"$error":"#REF!"},{"$f":"_xlfn.CHISQ.DIST(A960,#REF!,FALSE)","v":{"$error":"#REF!"}},{"$error":"#REF!"},{"$error":"#REF!"}]
[{"$error":"#REF!"},{"$f":"_xlfn.CHISQ.DIST(A961,#REF!,FALSE)","v":{"$error":"#REF!"}},{"$error":"#REF!"},{"$error":"#REF!"}]
[{"$error":"#REF!"},{"$f":"_xlfn.CHISQ.DIST(A962,#REF!,FALSE)","v":{"$error":"#REF!"}},{"$error":"#REF!"},{"$error":"#REF!"}]
[{"$error":"#REF!"},{"$f":"_xlfn.CHISQ.DIST(A963,#REF!,FALSE)","v":{"$error":"#REF!"}},{"$error":"#REF!"},{"$error":"#REF!"}]
[{"$error":"#REF!"},{"$f":"_xlfn.CHISQ.DIST(A964,#REF!,FALSE)","v":{"$error":"#REF!"}},{"$error":"#REF!"},{"$error":"#REF!"}]
[{"$error":"#REF!"},{"$f":"_xlfn.CHISQ.DIST(A965,#REF!,FALSE)","v":{"$error":"#REF!"}},{"$error":"#REF!"},{"$error":"#REF!"}]
[{"$error":"#REF!"},{"$f":"_xlfn.CHISQ.DIST(A966,#REF!,FALSE)","v":{"$error":"#REF!"}},{"$error":"#REF!"},{"$error":"#REF!"}]
[{"$error":"#REF!"},{"$f":"_xlfn.CHISQ.DIST(A967,#REF!,FALSE)","v":{"$error":"#REF!"}},{"$error":"#REF!"},{"$error":"#REF!"}]
[{"$error":"#REF!"},{"$f":"_xlfn.CHISQ.DIST(A968,#REF!,FALSE)","v":{"$error":"#REF!"}},{"$error":"#REF!"},{"$error":"#REF!"}]
[{"$error":"#REF!"},{"$f":"_xlfn.CHISQ.DIST(A969,#REF!,FALSE)","v":{"$error":"#REF!"}},{"$f":"IF($A969<$D$3,IF($A970>$D$3,MAX($B$9:$B$1009),\"\"),\"\")","v":{"$error":"#REF!"}},{"$f":"IF($A969<$D$4,IF($A970>$D$4,MAX($B$9:$B$1009),\"\"),\"\")","v":{"$error":"#REF!"}}]
[{"$f":"+A969+$B$4","v":{"$error":"#REF!"}},{"$f":"_xlfn.CHISQ.DIST(A970,#REF!,FALSE)","v":{"$error":"#REF!"}},{"$error":"#REF!"},{"$error":"#REF!"}]
[{"$error":"#REF!"},{"$f":"_xlfn.CHISQ.DIST(A971,#REF!,FALSE)","v":{"$error":"#REF!"}},{"$error":"#REF!"},{"$error":"#REF!"}]
[{"$error":"#REF!"},{"$f":"_xlfn.CHISQ.DIST(A972,#REF!,FALSE)","v":{"$error":"#REF!"}},{"$error":"#REF!"},{"$error":"#REF!"}]
[{"$error":"#REF!"},{"$f":"_xlfn.CHISQ.DIST(A973,#REF!,FALSE)","v":{"$error":"#REF!"}},{"$error":"#REF!"},{"$error":"#REF!"}]
[{"$error":"#REF!"},{"$f":"_xlfn.CHISQ.DIST(A974,#REF!,FALSE)","v":{"$error":"#REF!"}},{"$error":"#REF!"},{"$error":"#REF!"}]
[{"$error":"#REF!"},{"$f":"_xlfn.CHISQ.DIST(A975,#REF!,FALSE)","v":{"$error":"#REF!"}},{"$error":"#REF!"},{"$error":"#REF!"}]
[{"$error":"#REF!"},{"$f":"_xlfn.CHISQ.DIST(A976,#REF!,FALSE)","v":{"$error":"#REF!"}},{"$error":"#REF!"},{"$error":"#REF!"}]
[{"$error":"#REF!"},{"$f":"_xlfn.CHISQ.DIST(A977,#REF!,FALSE)","v":{"$error":"#REF!"}},{"$error":"#REF!"},{"$error":"#REF!"}]
[{"$error":"#REF!"},{"$f":"_xlfn.CHISQ.DIST(A978,#REF!,FALSE)","v":{"$error":"#REF!"}},{"$error":"#REF!"},{"$error":"#REF!"}]
[{"$error":"#REF!"},{"$f":"_xlfn.CHISQ.DIST(A979,#REF!,FALSE)","v":{"$error":"#REF!"}},{"$error":"#REF!"},{"$error":"#REF!"}]
[{"$error":"#REF!"},{"$f":"_xlfn.CHISQ.DIST(A980,#REF!,FALSE)","v":{"$error":"#REF!"}},{"$error":"#REF!"},{"$error":"#REF!"}]
[{"$error":"#REF!"},{"$f":"_xlfn.CHISQ.DIST(A981,#REF!,FALSE)","v":{"$error":"#REF!"}},{"$error":"#REF!"},{"$error":"#REF!"}]
[{"$error":"#REF!"},{"$f":"_xlfn.CHISQ.DIST(A982,#REF!,FALSE)","v":{"$error":"#REF!"}},{"$error":"#REF!"},{"$error":"#REF!"}]
[{"$error":"#REF!"},{"$f":"_xlfn.CHISQ.DIST(A983,#REF!,FALSE)","v":{"$error":"#REF!"}},{"$error":"#REF!"},{"$error":"#REF!"}]
[{"$error":"#REF!"},{"$f":"_xlfn.CHISQ.DIST(A984,#REF!,FALSE)","v":{"$error":"#REF!"}},{"$error":"#REF!"},{"$error":"#REF!"}]
[{"$error":"#REF!"},{"$f":"_xlfn.CHISQ.DIST(A985,#REF!,FALSE)","v":{"$error":"#REF!"}},{"$error":"#REF!"},{"$error":"#REF!"}]
[{"$error":"#REF!"},{"$f":"_xlfn.CHISQ.DIST(A986,#REF!,FALSE)","v":{"$error":"#REF!"}},{"$error":"#REF!"},{"$error":"#REF!"}]
[{"$error":"#REF!"},{"$f":"_xlfn.CHISQ.DIST(A987,#REF!,FALSE)","v":{"$error":"#REF!"}},{"$error":"#REF!"},{"$error":"#REF!"}]
[{"$error":"#REF!"},{"$f":"_xlfn.CHISQ.DIST(A988,#REF!,FALSE)","v":{"$error":"#REF!"}},{"$error":"#REF!"},{"$error":"#REF!"}]
[{"$error":"#REF!"},{"$f":"_xlfn.CHISQ.DIST(A989,#REF!,FALSE)","v":{"$error":"#REF!"}},{"$error":"#REF!"},{"$error":"#REF!"}]
[{"$error":"#REF!"},{"$f":"_xlfn.CHISQ.DIST(A990,#REF!,FALSE)","v":{"$error":"#REF!"}},{"$error":"#REF!"},{"$error":"#REF!"}]
[{"$error":"#REF!"},{"$f":"_xlfn.CHISQ.DIST(A991,#REF!,FALSE)","v":{"$error":"#REF!"}},{"$error":"#REF!"},{"$error":"#REF!"}]
[{"$error":"#REF!"},{"$f":"_xlfn.CHISQ.DIST(A992,#REF!,FALSE)","v":{"$error":"#REF!"}},{"$error":"#REF!"},{"$error":"#REF!"}]
[{"$error":"#REF!"},{"$f":"_xlfn.CHISQ.DIST(A993,#REF!,FALSE)","v":{"$error":"#REF!"}},{"$error":"#REF!"},{"$error":"#REF!"}]
[{"$error":"#REF!"},{"$f":"_xlfn.CHISQ.DIST(A994,#REF!,FALSE)","v":{"$error":"#REF!"}},{"$error":"#REF!"},{"$error":"#REF!"}]
[{"$error":"#REF!"},{"$f":"_xlfn.CHISQ.DIST(A995,#REF!,FALSE)","v":{"$error":"#REF!"}},{"$error":"#REF!"},{"$error":"#REF!"}]
[{"$error":"#REF!"},{"$f":"_xlfn.CHISQ.DIST(A996,#REF!,FALSE)","v":{"$error":"#REF!"}},{"$error":"#REF!"},{"$error":"#REF!"}]
[{"$error":"#REF!"},{"$f":"_xlfn.CHISQ.DIST(A997,#REF!,FALSE)","v":{"$error":"#REF!"}},{"$error":"#REF!"},{"$error":"#REF!"}]
[{"$error":"#REF!"},{"$f":"_xlfn.CHISQ.DIST(A998,#REF!,FALSE)","v":{"$error":"#REF!"}},{"$error":"#REF!"},{"$error":"#REF!"}]
[{"$error":"#REF!"},{"$f":"_xlfn.CHISQ.DIST(A999,#REF!,FALSE)","v":{"$error":"#REF!"}},{"$error":"#REF!"},{"$error":"#REF!"}]
[{"$error":"#REF!"},{"$f":"_xlfn.CHISQ.DIST(A1000,#REF!,FALSE)","v":{"$error":"#REF!"}},{"$error":"#REF!"},{"$error":"#REF!"}]
[{"$error":"#REF!"},{"$f":"_xlfn.CHISQ.DIST(A1001,#REF!,FALSE)","v":{"$error":"#REF!"}},{"$error":"#REF!"},{"$error":"#REF!"}]
[{"$error":"#REF!"},{"$f":"_xlfn.CHISQ.DIST(A1002,#REF!,FALSE)","v":{"$error":"#REF!"}},{"$error":"#REF!"},{"$error":"#REF!"}]
[{"$error":"#REF!"},{"$f":"_xlfn.CHISQ.DIST(A1003,#REF!,FALSE)","v":{"$error":"#REF!"}},{"$error":"#REF!"},{"$error":"#REF!"}]
[{"$error":"#REF!"},{"$f":"_xlfn.CHISQ.DIST(A1004,#REF!,FALSE)","v":{"$error":"#REF!"}},{"$error":"#REF!"},{"$error":"#REF!"}]
[{"$error":"#REF!"},{"$f":"_xlfn.CHISQ.DIST(A1005,#REF!,FALSE)","v":{"$error":"#REF!"}},{"$error":"#REF!"},{"$error":"#REF!"}]
[{"$error":"#REF!"},{"$f":"_xlfn.CHISQ.DIST(A1006,#REF!,FALSE)","v":{"$error":"#REF!"}},{"$error":"#REF!"},{"$error":"#REF!"}]
[{"$error":"#REF!"},{"$f":"_xlfn.CHISQ.DIST(A1007,#REF!,FALSE)","v":{"$error":"#REF!"}},{"$error":"#REF!"},{"$error":"#REF!"}]
[{"$error":"#REF!"},{"$f":"_xlfn.CHISQ.DIST(A1008,#REF!,FALSE)","v":{"$error":"#REF!"}},{"$error":"#REF!"},{"$error":"#REF!"}]
[{"$error":"#REF!"},{"$f":"_xlfn.CHISQ.DIST(A1009,#REF!,FALSE)","v":{"$error":"#REF!"}},{"$error":"#REF!"},{"$error":"#REF!"}]

{"sheet":"Regressionsanalyse","index":12,"n_rows":38,"n_cols":15,"rows_kept":38,"cut":false,"hidden":false,"merged":[[1,14,1,17],[1,4,1,8]]}
[null,"Forbedringsmuligheder","Opbakning"]
["USA",75,40,null,"Regressionsanalyse",null,null,null,null,null,null,null,null,null,"Tilbage til hovedmenuen"]
["Canada",75,61]
["Frankrig",44,48]
["Tyskland",61,56]
["Grækenland",24,16]
["Ungarn",39,45]
["Italien",32,29]
["Holland",79,64]
["Polen",73,51]
["Spanien",27,20]
["Sverige",80,69]
["Storbritannien",61,42]
["Rusland",46,44]
["Australien",77,59]
["Indien",73,54]
["Indonesien",89,65]
["Japan",54,40]
["Filippinerne",89,69]
["Israel",58,56]
["Tunesien",48,27]
["Kenya",67,52]
["Nigeria",65,39]
["Sydafrika",65,35]
["Argentina",45,35]
["Brasilien",48,16]
[]
[null,null,null,null,null,null,"Uafhængig variabel","forbedringsmuligheder af levestandard"]
[null,null,null,null,null,null,"Afhængig variabel","opbakningen til demokratiet"]
[null,null,null,null,null,null,"Y-akseskæring",{"$f":"ROUND(IF(B2=\"\",\"\",INTERCEPT(C2:C2522,B2:B2522)),2)","v":3.92}]
[null,null,null,null,null,null,"Hældningskoefficient",{"$f":"ROUND(IF(B2=\"\",\"\",SLOPE(C2:C2522,B2:B2522)),3)","v":0.69199999999999995}]
[null,null,null,null,null,null,"R2",{"$f":"ROUND(IF(B2=\"\",\"\",RSQ(C2:C2522,B2:B2522)),3)","v":0.66100000000000003},null,{"$f":"IF(B2=\"\",\"\",IF($H$32>0.9,\"Meget stærk samvariation\",IF($H$32>0.8,\"Stærk samvariation\",IF($H$32>0.5,\"Moderat samvariation\",IF($H$32>0.3,\"Svag samvariation\",\"Ringe samvariation\")))))","v":"Moderat samvariation"}]
[]
[null,null,null,null,null,null,null,null,null,{"$f":"IF(J32=\"\",\"\",\"Hvis der er samvariation: er der også en årsagssammenhæng?\")","v":"Hvis der er samvariation: er der også en årsagssammenhæng?"}]
[]
[]
[null,null,null,null,null,null,{"$f":"IF(H31>0,\"Da R2 er på \"&H32&\" betyder det, at \"&H28&\" kan forklare \"&H32*100&\" procent af variationen i \"&H29&\". \"&G31&\" på \"&H31&\" viser, at en stigning i \"&H28&\" på én enhed vil føre til en stigning i \"&H29&\" på \"&H31&\" \"&I31&\" enheder.\",\"Da R2 er på \"&H32&\" betyder det, at \"&H28&\" kan forklare \"&H32*100&\" procent af variationen i \"&H29&\". \"&G31&\" på \"&H31&\" viser, at en stigning i \"&H28&\" på én enhed vil føre til et fald i \"&H29&\" på \"&-H31&\" \"&-I31&\" enheder.\")","v":"Da R2 er på 0,661 betyder det, at forbedringsmuligheder af levestandard kan forklare 66,1 procent af variationen i opbakningen til demokratiet. Hældningskoefficient på 0,692 viser, at en stigning i forbedringsmuligheder af levestandard på én enhed vil føre til en stigning i opbakningen til demokratiet på 0,692  enheder."}]
[null,null,null,null,null,null,{"$f":"\"De resterende \"&100-H32*100&\" procent af variationen i \"&$H$29&\" må forklares med andre faktorer.\"","v":"De resterende 33,9 procent af variationen i opbakningen til demokratiet må forklares med andre faktorer."}]

{"sheet":"Regressionssimulator","index":13,"n_rows":104,"n_cols":9,"rows_kept":104,"cut":false,"hidden":false,"merged":[[5,8,5,11],[0,0,0,12]]}
["R2-simulator"]
[]
[null,null,null,"Vælg den ønskede styrke ved at benytte rullefeltet i den grønne celle"]
["X","Y"]
[{"$f":"RANDBETWEEN(0,100)","v":99},{"$f":"IF($G$6=\"Ingen\", 'R-square_help'!A2,Regressionssimulator!A5*'R-square_help'!C2+'R-square_help'!B2)","v":199}]
[{"$f":"RANDBETWEEN(0,100)","v":91},{"$f":"IF($G$6=\"Ingen\", 'R-square_help'!A3,Regressionssimulator!A6*'R-square_help'!C3+'R-square_help'!B3)","v":191},null,null,null,"Styrke","Perfekt",null,"Tilbage til hovedmenuen"]
[72,{"$f":"IF($G$6=\"Ingen\", 'R-square_help'!A4,Regressionssimulator!A7*'R-square_help'!C4+'R-square_help'!B4)","v":172}]
[11,{"$f":"IF($G$6=\"Ingen\", 'R-square_help'!A5,Regressionssimulator!A8*'R-square_help'!C5+'R-square_help'!B5)","v":111},null,null,null,{"$f":"\"Korrelationskoefficient = \"&ROUND(CORREL(A4:A104,B4:B104),3)","v":"Korrelationskoefficient = 1"}]
[43,{"$f":"IF($G$6=\"Ingen\", 'R-square_help'!A6,Regressionssimulator!A9*'R-square_help'!C6+'R-square_help'!B6)","v":143}]
[90,{"$f":"IF($G$6=\"Ingen\", 'R-square_help'!A7,Regressionssimulator!A10*'R-square_help'!C7+'R-square_help'!B7)","v":190}]
[10,{"$f":"IF($G$6=\"Ingen\", 'R-square_help'!A8,Regressionssimulator!A11*'R-square_help'!C8+'R-square_help'!B8)","v":110}]
[98,{"$f":"IF($G$6=\"Ingen\", 'R-square_help'!A9,Regressionssimulator!A12*'R-square_help'!C9+'R-square_help'!B9)","v":198}]
[98,{"$f":"IF($G$6=\"Ingen\", 'R-square_help'!A10,Regressionssimulator!A13*'R-square_help'!C10+'R-square_help'!B10)","v":198}]
[65,{"$f":"IF($G$6=\"Ingen\", 'R-square_help'!A11,Regressionssimulator!A14*'R-square_help'!C11+'R-square_help'!B11)","v":165}]
[53,{"$f":"IF($G$6=\"Ingen\", 'R-square_help'!A12,Regressionssimulator!A15*'R-square_help'!C12+'R-square_help'!B12)","v":153}]
[62,{"$f":"IF($G$6=\"Ingen\", 'R-square_help'!A13,Regressionssimulator!A16*'R-square_help'!C13+'R-square_help'!B13)","v":162}]
[59,{"$f":"IF($G$6=\"Ingen\", 'R-square_help'!A14,Regressionssimulator!A17*'R-square_help'!C14+'R-square_help'!B14)","v":159}]
[65,{"$f":"IF($G$6=\"Ingen\", 'R-square_help'!A15,Regressionssimulator!A18*'R-square_help'!C15+'R-square_help'!B15)","v":165}]
[63,{"$f":"IF($G$6=\"Ingen\", 'R-square_help'!A16,Regressionssimulator!A19*'R-square_help'!C16+'R-square_help'!B16)","v":163}]
[31,{"$f":"IF($G$6=\"Ingen\", 'R-square_help'!A17,Regressionssimulator!A20*'R-square_help'!C17+'R-square_help'!B17)","v":131}]
[17,{"$f":"IF($G$6=\"Ingen\", 'R-square_help'!A18,Regressionssimulator!A21*'R-square_help'!C18+'R-square_help'!B18)","v":117}]
[49,{"$f":"IF($G$6=\"Ingen\", 'R-square_help'!A19,Regressionssimulator!A22*'R-square_help'!C19+'R-square_help'!B19)","v":149}]
[96,{"$f":"IF($G$6=\"Ingen\", 'R-square_help'!A20,Regressionssimulator!A23*'R-square_help'!C20+'R-square_help'!B20)","v":196}]
[13,{"$f":"IF($G$6=\"Ingen\", 'R-square_help'!A21,Regressionssimulator!A24*'R-square_help'!C21+'R-square_help'!B21)","v":113}]
[86,{"$f":"IF($G$6=\"Ingen\", 'R-square_help'!A22,Regressionssimulator!A25*'R-square_help'!C22+'R-square_help'!B22)","v":186}]
[66,{"$f":"IF($G$6=\"Ingen\", 'R-square_help'!A23,Regressionssimulator!A26*'R-square_help'!C23+'R-square_help'!B23)","v":166}]
[96,{"$f":"IF($G$6=\"Ingen\", 'R-square_help'!A24,Regressionssimulator!A27*'R-square_help'!C24+'R-square_help'!B24)","v":196}]
[81,{"$f":"IF($G$6=\"Ingen\", 'R-square_help'!A25,Regressionssimulator!A28*'R-square_help'!C25+'R-square_help'!B25)","v":181}]
[64,{"$f":"IF($G$6=\"Ingen\", 'R-square_help'!A26,Regressionssimulator!A29*'R-square_help'!C26+'R-square_help'!B26)","v":164}]
[73,{"$f":"IF($G$6=\"Ingen\", 'R-square_help'!A27,Regressionssimulator!A30*'R-square_help'!C27+'R-square_help'!B27)","v":173}]
[73,{"$f":"IF($G$6=\"Ingen\", 'R-square_help'!A28,Regressionssimulator!A31*'R-square_help'!C28+'R-square_help'!B28)","v":173}]
[68,{"$f":"IF($G$6=\"Ingen\", 'R-square_help'!A29,Regressionssimulator!A32*'R-square_help'!C29+'R-square_help'!B29)","v":168}]
[14,{"$f":"IF($G$6=\"Ingen\", 'R-square_help'!A30,Regressionssimulator!A33*'R-square_help'!C30+'R-square_help'!B30)","v":114}]
[71,{"$f":"IF($G$6=\"Ingen\", 'R-square_help'!A31,Regressionssimulator!A34*'R-square_help'!C31+'R-square_help'!B31)","v":171}]
[62,{"$f":"IF($G$6=\"Ingen\", 'R-square_help'!A32,Regressionssimulator!A35*'R-square_help'!C32+'R-square_help'!B32)","v":162}]
[29,{"$f":"IF($G$6=\"Ingen\", 'R-square_help'!A33,Regressionssimulator!A36*'R-square_help'!C33+'R-square_help'!B33)","v":129}]
[94,{"$f":"IF($G$6=\"Ingen\", 'R-square_help'!A34,Regressionssimulator!A37*'R-square_help'!C34+'R-square_help'!B34)","v":194}]
[28,{"$f":"IF($G$6=\"Ingen\", 'R-square_help'!A35,Regressionssimulator!A38*'R-square_help'!C35+'R-square_help'!B35)","v":128}]
[77,{"$f":"IF($G$6=\"Ingen\", 'R-square_help'!A36,Regressionssimulator!A39*'R-square_help'!C36+'R-square_help'!B36)","v":177}]
[64,{"$f":"IF($G$6=\"Ingen\", 'R-square_help'!A37,Regressionssimulator!A40*'R-square_help'!C37+'R-square_help'!B37)","v":164}]
[43,{"$f":"IF($G$6=\"Ingen\", 'R-square_help'!A38,Regressionssimulator!A41*'R-square_help'!C38+'R-square_help'!B38)","v":143}]
[52,{"$f":"IF($G$6=\"Ingen\", 'R-square_help'!A39,Regressionssimulator!A42*'R-square_help'!C39+'R-square_help'!B39)","v":152}]
[2,{"$f":"IF($G$6=\"Ingen\", 'R-square_help'!A40,Regressionssimulator!A43*'R-square_help'!C40+'R-square_help'!B40)","v":102}]
[24,{"$f":"IF($G$6=\"Ingen\", 'R-square_help'!A41,Regressionssimulator!A44*'R-square_help'!C41+'R-square_help'!B41)","v":124}]
[9,{"$f":"IF($G$6=\"Ingen\", 'R-square_help'!A42,Regressionssimulator!A45*'R-square_help'!C42+'R-square_help'!B42)","v":109}]
[20,{"$f":"IF($G$6=\"Ingen\", 'R-square_help'!A43,Regressionssimulator!A46*'R-square_help'!C43+'R-square_help'!B43)","v":120}]
[80,{"$f":"IF($G$6=\"Ingen\", 'R-square_help'!A44,Regressionssimulator!A47*'R-square_help'!C44+'R-square_help'!B44)","v":180}]
[31,{"$f":"IF($G$6=\"Ingen\", 'R-square_help'!A45,Regressionssimulator!A48*'R-square_help'!C45+'R-square_help'!B45)","v":131}]
[0,{"$f":"IF($G$6=\"Ingen\", 'R-square_help'!A46,Regressionssimulator!A49*'R-square_help'!C46+'R-square_help'!B46)","v":100}]
[27,{"$f":"IF($G$6=\"Ingen\", 'R-square_help'!A47,Regressionssimulator!A50*'R-square_help'!C47+'R-square_help'!B47)","v":127}]
[26,{"$f":"IF($G$6=\"Ingen\", 'R-square_help'!A48,Regressionssimulator!A51*'R-square_help'!C48+'R-square_help'!B48)","v":126}]
[19,{"$f":"IF($G$6=\"Ingen\", 'R-square_help'!A49,Regressionssimulator!A52*'R-square_help'!C49+'R-square_help'!B49)","v":119}]
[37,{"$f":"IF($G$6=\"Ingen\", 'R-square_help'!A50,Regressionssimulator!A53*'R-square_help'!C50+'R-square_help'!B50)","v":137}]
[37,{"$f":"IF($G$6=\"Ingen\", 'R-square_help'!A51,Regressionssimulator!A54*'R-square_help'!C51+'R-square_help'!B51)","v":137}]
[21,{"$f":"IF($G$6=\"Ingen\", 'R-square_help'!A52,Regressionssimulator!A55*'R-square_help'!C52+'R-square_help'!B52)","v":121}]
[63,{"$f":"IF($G$6=\"Ingen\", 'R-square_help'!A53,Regressionssimulator!A56*'R-square_help'!C53+'R-square_help'!B53)","v":163}]
[32,{"$f":"IF($G$6=\"Ingen\", 'R-square_help'!A54,Regressionssimulator!A57*'R-square_help'!C54+'R-square_help'!B54)","v":132}]
[44,{"$f":"IF($G$6=\"Ingen\", 'R-square_help'!A55,Regressionssimulator!A58*'R-square_help'!C55+'R-square_help'!B55)","v":144}]
[76,{"$f":"IF($G$6=\"Ingen\", 'R-square_help'!A56,Regressionssimulator!A59*'R-square_help'!C56+'R-square_help'!B56)","v":176}]
[70,{"$f":"IF($G$6=\"Ingen\", 'R-square_help'!A57,Regressionssimulator!A60*'R-square_help'!C57+'R-square_help'!B57)","v":170}]
[88,{"$f":"IF($G$6=\"Ingen\", 'R-square_help'!A58,Regressionssimulator!A61*'R-square_help'!C58+'R-square_help'!B58)","v":188}]
[12,{"$f":"IF($G$6=\"Ingen\", 'R-square_help'!A59,Regressionssimulator!A62*'R-square_help'!C59+'R-square_help'!B59)","v":112}]
[42,{"$f":"IF($G$6=\"Ingen\", 'R-square_help'!A60,Regressionssimulator!A63*'R-square_help'!C60+'R-square_help'!B60)","v":142}]
[64,{"$f":"IF($G$6=\"Ingen\", 'R-square_help'!A61,Regressionssimulator!A64*'R-square_help'!C61+'R-square_help'!B61)","v":164}]
[21,{"$f":"IF($G$6=\"Ingen\", 'R-square_help'!A62,Regressionssimulator!A65*'R-square_help'!C62+'R-square_help'!B62)","v":121}]
[31,{"$f":"IF($G$6=\"Ingen\", 'R-square_help'!A63,Regressionssimulator!A66*'R-square_help'!C63+'R-square_help'!B63)","v":131}]
[43,{"$f":"IF($G$6=\"Ingen\", 'R-square_help'!A64,Regressionssimulator!A67*'R-square_help'!C64+'R-square_help'!B64)","v":143}]
[20,{"$f":"IF($G$6=\"Ingen\", 'R-square_help'!A65,Regressionssimulator!A68*'R-square_help'!C65+'R-square_help'!B65)","v":120}]
[56,{"$f":"IF($G$6=\"Ingen\", 'R-square_help'!A66,Regressionssimulator!A69*'R-square_help'!C66+'R-square_help'!B66)","v":156}]
[{"$f":"RANDBETWEEN(0,100)","v":34},{"$f":"IF($G$6=\"Ingen\", 'R-square_help'!A67,Regressionssimulator!A70*'R-square_help'!C67+'R-square_help'!B67)","v":134}]
[5,{"$f":"IF($G$6=\"Ingen\", 'R-square_help'!A68,Regressionssimulator!A71*'R-square_help'!C68+'R-square_help'!B68)","v":105}]
[99,{"$f":"IF($G$6=\"Ingen\", 'R-square_help'!A69,Regressionssimulator!A72*'R-square_help'!C69+'R-square_help'!B69)","v":199}]
[3,{"$f":"IF($G$6=\"Ingen\", 'R-square_help'!A70,Regressionssimulator!A73*'R-square_help'!C70+'R-square_help'!B70)","v":103}]
[47,{"$f":"IF($G$6=\"Ingen\", 'R-square_help'!A71,Regressionssimulator!A74*'R-square_help'!C71+'R-square_help'!B71)","v":147}]
[2,{"$f":"IF($G$6=\"Ingen\", 'R-square_help'!A72,Regressionssimulator!A75*'R-square_help'!C72+'R-square_help'!B72)","v":102}]
[48,{"$f":"IF($G$6=\"Ingen\", 'R-square_help'!A73,Regressionssimulator!A76*'R-square_help'!C73+'R-square_help'!B73)","v":148}]
[59,{"$f":"IF($G$6=\"Ingen\", 'R-square_help'!A74,Regressionssimulator!A77*'R-square_help'!C74+'R-square_help'!B74)","v":159}]
[56,{"$f":"IF($G$6=\"Ingen\", 'R-square_help'!A75,Regressionssimulator!A78*'R-square_help'!C75+'R-square_help'!B75)","v":156}]
[84,{"$f":"IF($G$6=\"Ingen\", 'R-square_help'!A76,Regressionssimulator!A79*'R-square_help'!C76+'R-square_help'!B76)","v":184}]
[30,{"$f":"IF($G$6=\"Ingen\", 'R-square_help'!A77,Regressionssimulator!A80*'R-square_help'!C77+'R-square_help'!B77)","v":130}]
[43,{"$f":"IF($G$6=\"Ingen\", 'R-square_help'!A78,Regressionssimulator!A81*'R-square_help'!C78+'R-square_help'!B78)","v":143}]
[100,{"$f":"IF($G$6=\"Ingen\", 'R-square_help'!A79,Regressionssimulator!A82*'R-square_help'!C79+'R-square_help'!B79)","v":200}]
[27,{"$f":"IF($G$6=\"Ingen\", 'R-square_help'!A80,Regressionssimulator!A83*'R-square_help'!C80+'R-square_help'!B80)","v":127}]
[23,{"$f":"IF($G$6=\"Ingen\", 'R-square_help'!A81,Regressionssimulator!A84*'R-square_help'!C81+'R-square_help'!B81)","v":123}]
[21,{"$f":"IF($G$6=\"Ingen\", 'R-square_help'!A82,Regressionssimulator!A85*'R-square_help'!C82+'R-square_help'!B82)","v":121}]
[95,{"$f":"IF($G$6=\"Ingen\", 'R-square_help'!A83,Regressionssimulator!A86*'R-square_help'!C83+'R-square_help'!B83)","v":195}]
[58,{"$f":"IF($G$6=\"Ingen\", 'R-square_help'!A84,Regressionssimulator!A87*'R-square_help'!C84+'R-square_help'!B84)","v":158}]
[52,{"$f":"IF($G$6=\"Ingen\", 'R-square_help'!A85,Regressionssimulator!A88*'R-square_help'!C85+'R-square_help'!B85)","v":152}]
[77,{"$f":"IF($G$6=\"Ingen\", 'R-square_help'!A86,Regressionssimulator!A89*'R-square_help'!C86+'R-square_help'!B86)","v":177}]
[65,{"$f":"IF($G$6=\"Ingen\", 'R-square_help'!A87,Regressionssimulator!A90*'R-square_help'!C87+'R-square_help'!B87)","v":165}]
[76,{"$f":"IF($G$6=\"Ingen\", 'R-square_help'!A88,Regressionssimulator!A91*'R-square_help'!C88+'R-square_help'!B88)","v":176}]
[47,{"$f":"IF($G$6=\"Ingen\", 'R-square_help'!A89,Regressionssimulator!A92*'R-square_help'!C89+'R-square_help'!B89)","v":147}]
[28,{"$f":"IF($G$6=\"Ingen\", 'R-square_help'!A90,Regressionssimulator!A93*'R-square_help'!C90+'R-square_help'!B90)","v":128}]
[2,{"$f":"IF($G$6=\"Ingen\", 'R-square_help'!A91,Regressionssimulator!A94*'R-square_help'!C91+'R-square_help'!B91)","v":102}]
[86,{"$f":"IF($G$6=\"Ingen\", 'R-square_help'!A92,Regressionssimulator!A95*'R-square_help'!C92+'R-square_help'!B92)","v":186}]
[22,{"$f":"IF($G$6=\"Ingen\", 'R-square_help'!A93,Regressionssimulator!A96*'R-square_help'!C93+'R-square_help'!B93)","v":122}]
[73,{"$f":"IF($G$6=\"Ingen\", 'R-square_help'!A94,Regressionssimulator!A97*'R-square_help'!C94+'R-square_help'!B94)","v":173}]
[10,{"$f":"IF($G$6=\"Ingen\", 'R-square_help'!A95,Regressionssimulator!A98*'R-square_help'!C95+'R-square_help'!B95)","v":110}]
[62,{"$f":"IF($G$6=\"Ingen\", 'R-square_help'!A96,Regressionssimulator!A99*'R-square_help'!C96+'R-square_help'!B96)","v":162}]
[26,{"$f":"IF($G$6=\"Ingen\", 'R-square_help'!A97,Regressionssimulator!A100*'R-square_help'!C97+'R-square_help'!B97)","v":126}]
[24,{"$f":"IF($G$6=\"Ingen\", 'R-square_help'!A98,Regressionssimulator!A101*'R-square_help'!C98+'R-square_help'!B98)","v":124}]
[48,{"$f":"IF($G$6=\"Ingen\", 'R-square_help'!A99,Regressionssimulator!A102*'R-square_help'!C99+'R-square_help'!B99)","v":148}]
[46,{"$f":"IF($G$6=\"Ingen\", 'R-square_help'!A100,Regressionssimulator!A103*'R-square_help'!C100+'R-square_help'!B100)","v":146}]
[49,{"$f":"IF($G$6=\"Ingen\", 'R-square_help'!A101,Regressionssimulator!A104*'R-square_help'!C101+'R-square_help'!B101)","v":149}]

{"sheet":"R-square_help","index":14,"n_rows":101,"n_cols":7,"rows_kept":101,"cut":false,"hidden":true,"merged":[]}
["Random","Skæring","Hældning",null,null,"Skæring","Hældning"]
[{"$f":"RANDBETWEEN(0,100)","v":16},{"$f":"RANDBETWEEN($F$2,$F$3)","v":100},{"$f":"RANDBETWEEN($G$2,$G$3)/100","v":1},null,null,{"$f":"VLOOKUP(Regressionssimulator!$G$6,'R-square_help'!$F$8:$G$11,2,FALSE)","v":100},{"$f":"IF(Regressionssimulator!$G$6=\"Perfekt\",100,90)","v":100}]
[{"$f":"RANDBETWEEN(0,100)","v":40},{"$f":"RANDBETWEEN($F$2,$F$3)","v":100},{"$f":"RANDBETWEEN($G$2,$G$3)/100","v":1},null,null,100,100]
[36,100,1]
[40,100,1]
[35,100,1]
[7,100,1,null,null,"Ingen",0]
[83,100,1,null,null,"Svag",-40]
[48,100,1,null,null,"Moderat",50]
[74,100,1,null,null,"Stærk",90]
[63,100,1,null,null,"Perfekt",100]
[35,100,1]
[49,100,1]
[10,100,1]
[7,100,1]
[46,100,1]
[62,100,1]
[20,100,1]
[40,100,1]
[16,100,1]
[52,100,1]
[34,100,1]
[46,100,1]
[26,100,1]
[96,100,1]
[35,100,1]
[90,100,1]
[46,100,1]
[61,100,1]
[51,100,1]
[62,100,1]
[1,100,1]
[32,100,1]
[20,100,1]
[18,100,1]
[97,100,1]
[36,100,1]
[5,100,1]
[7,100,1]
[84,100,1]
[25,100,1]
[84,100,1]
[30,100,1]
[64,100,1]
[93,100,1]
[36,100,1]
[46,100,1]
[3,100,1]
[82,100,1]
[19,100,1]
[5,100,1]
[80,100,1]
[41,100,1]
[88,100,1]
[97,100,1]
[24,100,1]
[24,100,1]
[12,100,1]
[18,100,1]
[38,100,1]
[66,100,1]
[19,100,1]
[55,100,1]
[52,100,1]
[2,100,1]
[66,100,1]
[{"$f":"RANDBETWEEN(0,100)","v":71},{"$f":"RANDBETWEEN($F$2,$F$3)","v":100},{"$f":"RANDBETWEEN($G$2,$G$3)/100","v":1}]
[18,100,1]
[15,100,1]
[8,100,1]
[64,100,1]
[2,100,1]
[23,100,1]
[36,100,1]
[0,100,1]
[88,100,1]
[8,100,1]
[30,100,1]
[67,100,1]
[63,100,1]
[68,100,1]
[31,100,1]
[70,100,1]
[75,100,1]
[9,100,1]
[88,100,1]
[6,100,1]
[32,100,1]
[24,100,1]
[23,100,1]
[45,100,1]
[88,100,1]
[4,100,1]
[6,100,1]
[24,100,1]
[88,100,1]
[93,100,1]
[66,100,1]
[90,100,1]
[28,100,1]
[79,100,1]